{"text_format":"1","workbook":"xlsx","n_sheets":17,"sheets":["Invulinstructie","1. Voorblad","2. Cliënt(en)","3. Uren zorg","4. Berekening","5. Doelen","6. Motivatie","7. Overige opmerkingen","8. Verhuisformulier","9. Rekenhulp ma-vr","10. Rekenhulp za-zo","11. Versiebeheer","Data (verbergen)","Data CAO 2019 (verbergen)","Data CAO GHZ 2019 (verbergen)","Data CAO VVT 2019 (verbergen)","Data CAO GGZ 2019 (verbergen)"],"not_rendered":{"charts":0,"images":1,"macros":0,"external_links":0,"defined_names":6,"comments":0,"pivot_tables":0},"unopened":[],"bounds":{"document_bytes":16777216,"sheet_cells":100000,"rows_first":2000,"rows_last":500,"rows_between":2000,"halvings":0,"cell_chars":16384,"cell_head_chars":4096},"cells_cut":0,"cells_raw":0,"read":"whole","date_system":"1900"}

{"sheet":"Invulinstructie","index":0,"n_rows":24,"n_cols":2,"rows_kept":24,"cut":false,"hidden":false,"merged":[[21,1,21,2],[23,1,23,2],[7,1,7,2],[5,1,5,2],[9,1,9,2],[11,1,11,2],[15,1,15,2],[17,1,17,2],[19,1,19,2],[13,1,13,2]]}
[]
[null,"Invulinstructie"]
[]
[]
[]
[null,"Start"]
[]
[null,"Dit sjabloon is een onderdeel van de aanvraag voor meerzorgtoekenning aan een intramuraal wonende cliënt (ZZP of VPT).\nDit sjabloon geldt voor alle meerzorgaanvragen, zowel individueel als in groepsverband; voor cliënten die eerder geen meerzorgtoekenning hebben én voor heraanvragen.\nBij (her-)aanvragen gebaseerd op gedragsproblematiek, zal het zorgkantoor na beoordeling van dit sjabloon besluiten of een verdere inhoudelijke toetsing door het CCE uitgevoerd mag worden.\n\nGebruik altijd per cliënt of cliëntgroep een recent, nieuw en leeg sjabloon.\nAlle lichtblauwe velden zijn invulbaar of via een rolmenu te benaderen."]
[]
[null,"Voorblad"]
{"$rows_left_out":15}
{"sheet":"1. Voorblad","index":1,"n_rows":38,"n_cols":14,"rows_kept":38,"cut":false,"hidden":false,"merged":[[0,1,0,2],[21,5,21,6],[25,1,25,2],[1,1,1,5],[31,1,34,2],[25,5,25,6]]}
[null,"Alleen een verhuizing doorgeven? Klik hier!",null,null,null,null,null,null,"vanaf hier verbergen"]
[null,"Sjabloon Aanvraag Meerzorg 2019"]
[]
[null,"Wlz-zorgaanbieder"]
[null,null,null,"cat.","nr."]
[null,"Registratienummer NZa",null,300]
[null,null,null,null,null,null,"© 2019 Zorgverzekeraars Nederland"]
[null,"AGB-code",null,null,null,null,"Versie 2019.03"]
[]
[null,"Zorgaanbieder",null,null,null,"Zorgkantoor"]
{"$rows_left_out":29}
{"sheet":"2. Cliënt(en)","index":2,"n_rows":40,"n_cols":34,"rows_kept":40,"cut":false,"hidden":false,"merged":[[5,21,7,21]]}
[null,null,null,null,null,null,null,null,null,null,null,null,null,null,null,null,null,null,null,null,null,null,null,"vanaf hier verbergen"]
[null,null,null,"Overzicht Cliënt(en)"]
[null,null,null,"Let op: datumnotatie is dd-mm-jj"]
[]
[]
[null,null,null,null,null,null,null,null,null,null,null,null,null,null,null,null,null,null,null,null,null,"Indien van toepassing: CCE-verklaring\ngeldig tot"]
[]
[null,null,null,"Naam cliënt",null,"Geboorte-\ndatum",null,"BSN",null,"Geïndiceerd\nZZP",null,"Dagbesteding\nvan toepassing?\nJa/Nee",null,"Behandeling\nvan toepassing?\nJa/Nee",null,"Prestatie-\ncode\nNZA",null,"Datum\nopname",null,"Beoogde\ningang",null,null,null,null,null,null,null,null,"Codering","Etmaal","NZA-jaar","Aanbieder","Geldig BSN","Geldig NZA"]
[]
[null,1,null,null,null,null,null,null,null,null,null,null,null,null,null,null,null,null,null,null,null,null,null,null,null,null,null,null,{"$f":"CONCATENATE(J10,N10,L10)","v":""},{"$f":"IFERROR(VLOOKUP(AC10,'Data (verbergen)'!O:T,4,0),0)","v":0},{"$f":"IF('3. Uren zorg'!AO11=1,'2. Cliënt(en)'!AD10*365,0)","v":0},{"$f":"AE10","v":0},{"$f":"IF((MOD(SUM({9;8;7;6;5;4;3;2;-1}*MID(TEXT(H10,\"000000000\"),{1;2;3;4;5;6;7;8;9},1)),11)=0),\"geldig\",\"ongeldig\")","v":"geldig"},{"$f":"IF(P10=\"Niet geldig\",1,0)","v":0}]
{"$rows_left_out":31}
{"sheet":"3. Uren zorg","index":3,"n_rows":41,"n_cols":63,"rows_kept":41,"cut":false,"hidden":false,"merged":[[6,47,6,50],[6,43,6,46],[6,51,6,54],[6,59,6,62],[6,55,6,58],[6,15,6,17],[1,3,1,32],[6,21,6,27],[6,9,6,11],[6,5,6,7],[6,31,6,35]]}
[null,null,null,null,null,null,null,null,null,null,null,null,null,null,null,null,null,null,null,null,null,null,null,null,null,null,null,null,null,null,null,null,null,null,null,null,null,null,null,"vanaf hier verbergen"]
[null,null,null,"Uren zorg"]
[null,null,null,"Let op: urennotatie is uu:mm",null,null,null,null,null,null,null,null,null,null,null,null,null,null,null,null,null,null,null,null,null,null,null,null,null,null,null,null,null,null,null,null,null,null,null,null,null,null,"Controle uren"]
[null,null,null,null,null,null,null,null,null,null,null,null,null,null,null,null,null,null,null,null,null,null,null,null,null,null,null,null,null,null,null,null,null,null,null,null,null,null,null,null,null,null,"23:59:00"]
[null,null,null,null,null,null,null,null,null,null,null,null,null,null,null,null,null,null,null,null,null,null,null,null,null,null,null,null,null,null,null,null,null,null,null,null,null,null,null,null,null,null,null,null,null,null,null,null,null,null,null,null,1.25,null,null,null,0.1]
[]
[null,null,null,null,null,"Wonen ma-vr",null,null,null,"Wonen za-zo",null,null,null,null,null,"Dagbesteding",null,null,null,null,null,"Behandeling (uren per week)",null,null,null,null,null,null,null,null,null,"Overig (uren per week)",null,null,null,null,null,null,null,null,null,null,null,"Rekenkundig",null,null,null,"Uren ZZP",null,null,null,"Drempel",null,null,null,"Saldo",null,null,null,"T.b.v. berekening"]
[]
[null,null,null,"Naam cliënt",null,"Uren\nper dag",null,"Dagen\nper week",null,"Uren\nper dag",null,"Dagen\nper week",null,"Totaal\nWonen",null,"Uren\nper dag",null,"Dagen\nper week",null,"Totaal\nDagbs.",null,"Gedrags-\ndeskundige",null,"Psychiater",null,"Arts",null,"Overig",null,"Totaal\nBehan.",null,"Nacht-\nopvang",null,"Restpost\nuren*",null,"Min\nuren**",null,"Meerzorgwaardig?",null,null,null,"Wonen","Dagbesteding","Wonen","Dagbesteding","Behandeling","Totaal","Wonen","Dagbesteding","Behandeling","Totaal","Wonen","Dagbesteding","Behandeling","Totaal","Wonen","Dagbesteding","Behandeling","Totaal","Wonen","Dagbesteding","Behandeling","Totaal"]
[]
{"$rows_left_out":32}
{"sheet":"4. Berekening","index":4,"n_rows":45,"n_cols":18,"rows_kept":45,"cut":false,"hidden":false,"merged":[[26,3,26,13],[28,3,28,13],[42,3,42,7],[44,3,44,13],[20,3,20,13],[24,3,24,13],[38,3,38,13],[36,3,36,13],[22,3,22,13],[40,3,40,13],[20,1,22,1],[10,3,10,5],[12,3,12,5],[14,3,14,5],[18,3,18,13]]}
[null,null,null,null,null,null,null,null,null,null,null,null,null,null,null,null,null,"vanaf hier verbergen"]
[null,"Berekening meerzorg"]
[]
[]
[]
[]
[null,"Directe zorgkosten"]
[]
[null,null,null,null,null,null,null,"Uren\nzorg",null,"Uren\nzzp",null,"Uren\nmeerzorg",null,{"$f":"CONCATENATE(\"Normbedrag \", '1. Voorblad'!G19)","v":"Normbedrag "},null,"Jaarbedrag"]
[]
{"$rows_left_out":36}
{"sheet":"5. Doelen","index":5,"n_rows":63,"n_cols":2,"rows_kept":63,"cut":false,"hidden":false,"merged":[[64,2,74,2],[9,2,18,2],[48,1,48,2],[62,1,62,2],[5,1,5,2],[7,1,7,2],[20,1,20,2],[34,1,34,2]]}
[]
[null,"Doelen"]
[]
[]
[]
[null,"In te vullen door zorgaanbieder"]
[]
[null,"Perspectief (schets het perspectief in het kader waarvan de hieronder genoemde doelen ingezet gaan worden)"]
[]
[]
{"$rows_left_out":54}
{"sheet":"6. Motivatie","index":6,"n_rows":23,"n_cols":8,"rows_kept":23,"cut":false,"hidden":false,"merged":[[9,7,18,8],[22,7,31,8],[5,1,5,2],[7,1,7,2],[9,1,18,2],[20,1,20,2],[22,2,60,2]]}
[null,null,null,null,"Vanaf hier verbergen"]
[null,"Motivatie"]
[]
[]
[]
[null,"In te vullen door zorgaanbieder"]
[]
[null,{"$f":"CONCATENATE(B2,\" \",'1. Voorblad'!C22)","v":"Motivatie "}]
[]
[null,{"$f":"IF('1. Voorblad'!K22=1,H10,IF('1. Voorblad'!K22=2,H23,\"\"))","v":""},null,null,null,null,null,"Beantwoord in onderstaand veld, voor zover van toepassing, de onderstaande vragen:\n\n- Waarom past de zorgvraag van de cliënt niet binnen het zorgprofiel?\n- Waaruit blijkt de extreme zorgbehoefte?\n- Wat is de aanleiding van de meerzorg en wat is de frequentie?\n- Welke interventiemiddelen zijn er toe nu toe ingezet en met welk effect?\n- Is er een concrete vraag voor het CCE en zoja, wat is deze vraag?"]
{"$rows_left_out":14}
{"sheet":"7. Overige opmerkingen","index":7,"n_rows":34,"n_cols":2,"rows_kept":34,"cut":false,"hidden":false,"merged":[[35,2,44,2],[33,1,33,2],[5,1,5,2],[7,1,7,2],[20,1,20,2],[9,2,18,2],[22,2,31,2]]}
[]
[null,"Overige opmerkingen"]
[]
[]
[]
[null,"In te vullen door zorgaanbieder"]
[]
[null,"Restpost- en minuren"]
[]
[]
{"$rows_left_out":25}
{"sheet":"8. Verhuisformulier","index":8,"n_rows":57,"n_cols":7,"rows_kept":57,"cut":false,"hidden":false,"merged":[[1,1,1,5],[56,5,60,6],[56,1,60,2],[50,5,54,6],[50,1,54,2]]}
[]
[null,"Verhuisformulier Meerzorg 2019"]
[]
[null,"Registratienummers Nza oude en nieuwe aanbieder"]
[null,null,null,"cat.","nr."]
[null,"Registratienummer Nza oude zorgaanbieder",null,300]
[]
[null,"Registratienummer Nza nieuwe zorgaanbieder",null,300]
[]
[null,"Gegevens OUDE Zorgaanbieder",null,null,null,"Gegevens OUD Zorgkantoor"]
{"$rows_left_out":48}
{"sheet":"9. Rekenhulp ma-vr","index":9,"n_rows":44,"n_cols":16,"rows_kept":44,"cut":false,"hidden":false,"merged":[[4,7,4,9],[5,7,5,9],[6,7,6,9],[7,7,7,9],[6,11,6,13],[7,11,7,13]]}
[]
[null,"Rekenhulp maandag-vrijdag"]
[null,"In te vullen per individuele cliënt"]
[]
[null,"Naam cliënt:"]
[null,"Woonlocatie:"]
[null,"Dagbestedingslocatie:",null,null,null,null,null,null,null,null,null,"Over te nemen bij wonen ma-vr",null,null,null,{"$f":"SUMIF($H$12:$H$44,\"Wonen\",$P$12:$P$44)","v":"00:00:00"}]
[null,"Ingevuld/opgesteld door:",null,null,null,null,null,null,null,null,null,"Over te nemen bij dagbesteding",null,null,null,{"$f":"SUMIF($H$12:$H$44,\"Dagbesteding\",$P$12:$P$44)","v":"00:00:00"}]
[]
[null,"Tijd van",null,"Tijd tot",null,"Uren",null,"Functie",null,"Activiteit (Wat)",null,"Begeleidingsstijl (Hoe)",null,"1 op …",null,"Formatie-\nuren"]
{"$rows_left_out":35}
{"sheet":"10. Rekenhulp za-zo","index":10,"n_rows":44,"n_cols":16,"rows_kept":44,"cut":false,"hidden":false,"merged":[[4,7,4,9],[5,7,5,9],[6,7,6,9],[6,11,6,13],[7,7,7,9],[7,11,7,13]]}
[]
[null,"Rekenhulp zaterdag-zondag"]
[null,"In te vullen per individuele cliënt"]
[]
[null,"Naam cliënt:"]
[null,"Woonlocatie:"]
[null,"Dagbestedingslocatie:",null,null,null,null,null,null,null,null,null,"Over te nemen bij wonen za-zo",null,null,null,{"$f":"SUMIF($H$12:$H$44,\"Wonen\",$P$12:$P$44)","v":"00:00:00"}]
[null,"Ingevuld/opgesteld door:"]
[]
[null,"Tijd van",null,"Tijd tot",null,"Uren",null,"Functie",null,"Activiteit (Wat)",null,"Begeleidingsstijl (Hoe)",null,"1 op …",null,"Formatie-\nuren"]
{"$rows_left_out":35}
{"sheet":"11. Versiebeheer","index":11,"n_rows":16,"n_cols":8,"rows_kept":16,"cut":false,"hidden":false,"merged":[]}
[]
[null,"Versiebeheer"]
[]
[]
[]
[]
[null,"Datum",null,"Versie",null,"Tabblad",null,"Opmerkingen/wijzigingen"]
[]
[null,"2018-11-09",null,"2019.01",null,null,null,"Publicatie"]
[]
{"$rows_left_out":7}
{"sheet":"Data (verbergen)","index":12,"n_rows":1598,"n_cols":41,"rows_kept":1598,"cut":false,"hidden":true,"merged":[[0,0,0,4]]}
["Zoektabel ZA-ZK",null,null,null,null,null,"Soort problematiek",null,"Indicatie","WN","DB","BH","TOT",null,"Tarieven 2019 Loon en Materieel",null,"Nza","Loon","Mat.","Totaal","WN","DB","BH","TOT",null,"Geldig","Excl. bh","Incl. bh","Excl. db","Incl. db",null,"Tijden",null,"Functie",null,"Bezetting",null,"Sector","Prestatie","Codes","Tarief 2019"]
["NR","NAAM","PLAATS","ZOKA","PLAATSZOKA",null,"Cliënt(en) met enkel somatische problematiek",null,"GGZ6B",19.48,3.41,2.2999999999999998,{"$f":"SUM(J2:L2)","v":25.19},null,"GGZ6BJaNee","Z262 ZZP 6ggz-b incl.bh excl.db",{"$f":"LEFT(P2,4)","v":"Z262"},239.41,58.44,{"$f":"SUM(R2:S2)","v":297.85000000000002},19.48,null,2.2999999999999998,{"$f":"SUM(U2:W2)","v":21.78},null,"GGZ6B",null,"x","x","x",null,"07:00:00",null,"Wonen",null,0,null,"GHZ","Wonen","Z001",40.46]
[1,"Zorgcentrum 'De Blanckenbörg'",3010,"Menzis","Zorgkantoor Groningen",null,"Cliënt(en) met enkel gedragsproblematiek",null,"GGZ7B",28.32,5.35,2.2999999999999998,35.97,null,"GGZ6BJaJa","Z263 ZZP 6ggz-b incl.bh incl.db","Z263",258.77999999999997,62.03,320.80999999999995,19.48,3.41,2.2999999999999998,25.19,null,"GGZ7B",null,"x","x","x",null,"07:15:00",null,"Dagbesteding",null,0.2,null,"VVT","Wonen","Z004",44.14]
[3,"Woon-en Zorgcentrum Burgemeester van Julsingha Tehuis",3010,"Menzis","Zorgkantoor Groningen",null,"Cliënt(en) met gedrags- en somatische problematiek",null,"LG5",18.38,5.82,2.31,26.509999999999998,null,"GGZ7BJaNee","Z272 ZZP 7ggz-b incl.bh excl.db","Z272",270.95,60.67,331.62,28.32,null,2.2999999999999998,30.62,null,"LG5","x","x","x","x",null,"07:30:00",null,null,null,0.25,null,"GGZ","Wonen","Z007",48.81]
[4,"Woonzorgcentrum Het Hooge Heem",3010,"Menzis","Zorgkantoor Groningen",null,"Cliënt(en) met gedrags- en of somatische problematiek",null,"LG6",20.57,5.3,2.71,28.580000000000002,null,"GGZ7BJaJa","Z273 ZZP 7ggz-b incl.bh incl.db","Z273",307,67.22,374.22,28.32,5.35,2.2999999999999998,35.97,null,"LG6","x","x","x","x",null,"07:45:00",null,null,null,0.33]
[5,"Stichting De Twentse Zorgcentra",3050,"Menzis","Zorgkantoor Twente",null,null,null,"LG7",23.34,4.4400000000000004,2.4500000000000002,30.23,null,"LG5NeeNee","Z650 ZZP 5lg excl.bh excl.db","Z650",110.35,34.71,145.06,18.38,null,null,18.38,null,"LG7","x","x","x","x",null,"08:00:00",null,null,null,0.4,null,"GHZ","Dagbesteding","Z002",42.14]
[6,"Stichting Vredewold",3010,"Menzis","Zorgkantoor Groningen",null,"Soort aanvraag",null,"LVG4",23.15,2.2999999999999998,4.4800000000000004,29.93,null,"LG5NeeJa","Z651 ZZP 5lg excl.bh incl.db","Z651",152.87,39.479999999999997,192.35,18.38,5.82,null,24.2,null,"LVG4",null,"x",null,"x",null,"08:15:00",null,null,null,0.5,null,"VVT","Dagbesteding","Z005",44.11]
[7,"Stichting Cello",3280,"UVIT","Zorgkantoor Noordoost-Brabant",null,"Enkelvoudige aanvraag (individueel)",null,"LVG5",23.15,2.2999999999999998,4.4800000000000004,29.93,null,"LG5JaNee","Z652 ZZP 5lg incl.bh excl.db","Z652",142.86000000000001,39.409999999999997,182.27,18.38,null,2.31,20.689999999999998,null,"LVG5",null,"x",null,"x",null,"08:30:00",null,null,null,0.6,null,"GGZ","Dagbesteding","Z008",47.09]
[8,"Stichting S&L Zorg",3260,"CZ","Zorgkantoor West-Brabant",null,"Meervoudige aanvraag (groepsmeerzorg)",null,"SGLVG",31.7,4,3.73,39.43,null,"LG5JaJa","Z653 ZZP 5lg incl.bh incl.db","Z653",177.74,50.81,228.55,18.38,5.82,2.31,26.509999999999998,null,"SGLVG",null,"x",null,"x",null,"08:45:00",null,null,null,0.7]
[9,"stichting R.K. Ouderenzorg St. Franciscus",3010,"Menzis","Zorgkantoor Groningen",null,null,null,"VG5",16.71,6.76,1.24,24.709999999999997,null,"LG6Neenee","Z660 ZZP 6lg excl.bh excl.db","Z660",171.94,41.6,213.54,20.57,null,null,20.57,null,"VG5","x","x","x","x",null,"09:00:00",null,null,null,0.75,null,"GHZ","Behandeling","Z003",80.19]
{"$rows_left_out":1589}
{"sheet":"Data CAO 2019 (verbergen)","index":13,"n_rows":208,"n_cols":24,"rows_kept":208,"cut":false,"hidden":true,"merged":[]}
[null,null,null,null,null,null,1,null,null,null,"Wonen",0.60599999999999998,null,null,null,"DB",0.61799999999999999,null,null,null,"BH",0.47399999999999998]
["FWG/trede","GHZ","VVT","GGZ",null,"FWG/trede","GHZ","VVT","GGZ",null,"FWG/trede","GHZ","VVT","GGZ",null,"FWG/trede","GHZ","VVT","GGZ",null,"FWG/trede","GHZ","VVT","GGZ"]
["10/0",{"$f":"IFERROR(VLOOKUP(A3,'Data CAO GHZ 2019 (verbergen)'!C:K,9,0),\"NVT\")","v":14.492811501597444},{"$f":"IFERROR(VLOOKUP(A3,'Data CAO VVT 2019 (verbergen)'!C:M,11,0),\"NVT\")","v":14.140607207667731},{"$f":"IFERROR(VLOOKUP(A3,'Data CAO GGZ 2019 (verbergen)'!C:M,11,0),\"NVT\")","v":14.816587859424923},null,10,{"$f":"AVERAGE(B3:B13)/$G$1","v":16.688117194307292},14.854779095207666,16.562428115015976,null,10,{"$f":"G3/$L$1","v":27.538147185325567},24.512836790771729,27.330739463722733,null,10,{"$f":"G3/$Q$1","v":27.003425880756136},24.036859377358684,26.800045493553359,null,10,{"$f":"G3/$V$1","v":35.20699830022636},31.339196403391703,34.94183146627843]
["10/1",{"$f":"IFERROR(VLOOKUP(A4,'Data CAO GHZ 2019 (verbergen)'!C:K,9,0),\"NVT\")","v":14.758386581469649},{"$f":"IFERROR(VLOOKUP(A4,'Data CAO VVT 2019 (verbergen)'!C:M,11,0),\"NVT\")","v":14.407767424920126},{"$f":"IFERROR(VLOOKUP(A4,'Data CAO GGZ 2019 (verbergen)'!C:M,11,0),\"NVT\")","v":15.363603833865815},null,15,{"$f":"AVERAGE(B14:B25)/$G$1","v":17.437849440894567},17.527086367057152,17.305510543130989,null,15,{"$f":"G4/$L$1","v":28.775329110387077},28.922584764120714,28.556948090975229,null,15,{"$f":"G4/$Q$1","v":28.216584855816453},28.360981176467885,28.002444244548528,null,15,{"$f":"G4/$V$1","v":36.78871190062145},36.976975457926478,36.509515913778458]
["10/2",{"$f":"IFERROR(VLOOKUP(A5,'Data CAO GHZ 2019 (verbergen)'!C:K,9,0),\"NVT\")","v":15.327476038338656},{"$f":"IFERROR(VLOOKUP(A5,'Data CAO VVT 2019 (verbergen)'!C:M,11,0),\"NVT\")","v":14.674831782747601},{"$f":"IFERROR(VLOOKUP(A5,'Data CAO GGZ 2019 (verbergen)'!C:M,11,0),\"NVT\")","v":15.655974440894568},null,20,{"$f":"AVERAGE(B26:B37)/$G$1","v":18.442450412673058},18.555636694355698,18.085822828928261,null,20,{"$f":"G5/$L$1","v":30.433086489559503},30.619862531940097,29.844592126944328,null,20,{"$f":"G5/$Q$1","v":29.842152771315629},30.025302094426696,29.265085483702688,null,20,{"$f":"G5/$V$1","v":38.908123233487466},39.146912857290502,38.155744364827555]
["10/3",{"$f":"IFERROR(VLOOKUP(A6,'Data CAO GHZ 2019 (verbergen)'!C:K,9,0),\"NVT\")","v":15.896565495207664},{"$f":"IFERROR(VLOOKUP(A6,'Data CAO VVT 2019 (verbergen)'!C:M,11,0),\"NVT\")","v":15.246058095846646},{"$f":"IFERROR(VLOOKUP(A6,'Data CAO GGZ 2019 (verbergen)'!C:M,11,0),\"NVT\")","v":16.070952076677315},null,25,{"$f":"AVERAGE(B38:B49)/$G$1","v":19.478667465388714},19.411504788498405,19.127553877432472,null,25,{"$f":"G6/$L$1","v":32.143015619453323},32.032186119634332,31.563620259789559,null,25,{"$f":"G6/$Q$1","v":31.518879393832872},31.410201923136579,30.950734429502383,null,25,{"$f":"G6/$V$1","v":41.094235159047919},40.952541747886933,40.353489192895516]
["10/4",{"$f":"IFERROR(VLOOKUP(A7,'Data CAO GHZ 2019 (verbergen)'!C:K,9,0),\"NVT\")","v":16.190595047923324},{"$f":"IFERROR(VLOOKUP(A7,'Data CAO VVT 2019 (verbergen)'!C:M,11,0),\"NVT\")","v":15.804630964856232},{"$f":"IFERROR(VLOOKUP(A7,'Data CAO GGZ 2019 (verbergen)'!C:M,11,0),\"NVT\")","v":16.485929712460063},null,30,{"$f":"AVERAGE(B50:B61)/$G$1","v":20.504609291799788},19.715320778390943,20.182145803078708,null,30,{"$f":"G7/$L$1","v":33.835988930362689},32.533532637608815,33.303870962176084,null,30,{"$f":"G7/$Q$1","v":33.178979436569236},31.901813557266898,32.657193856114411,null,30,{"$f":"G7/$V$1","v":43.258669391982679},41.593503751879631,42.578366673161831]
["10/5",{"$f":"IFERROR(VLOOKUP(A8,'Data CAO GHZ 2019 (verbergen)'!C:K,9,0),\"NVT\")","v":16.64586661341853},null,{"$f":"IFERROR(VLOOKUP(A8,'Data CAO GGZ 2019 (verbergen)'!C:M,11,0),\"NVT\")","v":16.910338658146962},null,35,{"$f":"AVERAGE(B62:B73)/$G$1","v":21.686260316826417},21.204584089456869,21.349913447574785,null,35,{"$f":"G8/$L$1","v":35.785908113574948},34.991062853889225,35.230880276526051,null,35,{"$f":"G8/$Q$1","v":35.091036111369604},34.311624740221468,34.546785513875058,null,35,{"$f":"G8/$V$1","v":45.75160404393759},44.735409471428,45.04201149277381]
["10/6",{"$f":"IFERROR(VLOOKUP(A9,'Data CAO GHZ 2019 (verbergen)'!C:K,9,0),\"NVT\")","v":17.072683706070286},null,{"$f":"IFERROR(VLOOKUP(A9,'Data CAO GGZ 2019 (verbergen)'!C:M,11,0),\"NVT\")","v":17.381904153354633},null,40,{"$f":"AVERAGE(B74:B86)/$G$1","v":22.897946618743347},23.191915543421434,23.180708773654455,null,40,{"$f":"G9/$L$1","v":37.785390459972518},38.270487695414907,38.251994675997452,null,40,{"$f":"G9/$Q$1","v":37.051693557837133},37.527371429484518,37.509237497822745,null,40,{"$f":"G9/$V$1","v":48.307904258952213},48.928091863758304,48.90444888956636]
["10/7",{"$f":"IFERROR(VLOOKUP(A10,'Data CAO GHZ 2019 (verbergen)'!C:K,9,0),\"NVT\")","v":17.508985623003195},null,{"$f":"IFERROR(VLOOKUP(A10,'Data CAO GGZ 2019 (verbergen)'!C:M,11,0),\"NVT\")","v":17.910057507987222},null,45,{"$f":"AVERAGE(B87:B99)/$G$1","v":24.937062238879335},26.497877627263044,25.645182600147454,null,45,{"$f":"G10/$L$1","v":41.150267720922997},43.725870672051229,42.318783168560152,null,45,{"$f":"G10/$Q$1","v":40.351233396244879},42.876824639584214,41.497059223539573,null,45,{"$f":"G10/$V$1","v":52.609835947002821},55.902695416166765,54.103760759804757]
{"$rows_left_out":199}
{"sheet":"Data CAO GHZ 2019 (verbergen)","index":14,"n_rows":212,"n_cols":11,"rows_kept":212,"cut":false,"hidden":true,"merged":[]}
["Cao GHZ schalen per 1-1-2019"]
[null,null,null,null,7.0499999999999993E-2,0.08,3.6999999999999998E-2,null,{"$f":"17%+8%","v":0.25},null,{"$f":"1878/12","v":156.5}]
["Funct.schaal","Trede","Samengesteld","Salaris","EJU","Vak toeslag","PBL","Brutoloon","Soc.lasten + pens.pr.","Tot incl soc lst + pens.pr.","Uurloon"]
[5,0,{"$f":"CONCATENATE(A4,\"/\",B4)","v":"5/0"},1501,{"$f":"D4*$E$2","v":105.8205},{"$f":"D4*$F$2","v":120.08},{"$f":"D4*$G$2","v":55.536999999999999},{"$f":"SUM(D4:G4)","v":1782.4375},{"$f":"H4*$I$2","v":445.609375},{"$f":"SUM(H4:I4)","v":2228.046875},{"$f":"J4/$K$2","v":14.23672124600639}]
[5,1,"5/1",1528,107.72399999999999,122.24000000000001,56.535999999999994,1814.5,453.625,2268.125,14.492811501597444]
[5,2,"5/2",1556,109.69799999999999,124.48,57.571999999999996,1847.75,461.9375,2309.6875,14.758386581469649]
[5,3,"5/3",1616,113.92799999999998,129.28,59.791999999999994,1918.9999999999998,479.74999999999994,2398.7499999999995,15.327476038338656]
[5,4,"5/4",1676,118.15799999999999,134.08000000000001,62.012,1990.2499999999998,497.56249999999994,2487.8124999999995,15.896565495207664]
[5,5,"5/5",1707,120.34349999999999,136.56,63.158999999999999,2027.0625,506.765625,2533.828125,16.190595047923324]
[5,6,"5/6",1755,123.72749999999999,140.4,64.935000000000002,2084.0625,521.015625,2605.078125,16.64586661341853]
{"$rows_left_out":203}
{"sheet":"Data CAO VVT 2019 (verbergen)","index":15,"n_rows":183,"n_cols":13,"rows_kept":183,"cut":false,"hidden":true,"merged":[]}
["Cao VVT schalen per 1-1-2019"]
[null,null,null,null,0.04,null,7.3999999999999996E-2,0.08,null,null,{"$f":"17%+8%","v":0.25},null,{"$f":"1878/12","v":156.5}]
["Funct.schaal","Trede","Samengesteld","Salaris","Verhoging","Nieuw salaris","EJU","Vak toeslag","PBL","Brutoloon","Soc.lasten + pens.pr.","Tot incl soc lst + pens.pr.","Uurloon"]
[10,0,{"$f":"CONCATENATE(A4,\"/\",B4)","v":"10/0"},1475.14,{"$f":"D4*$E$2","v":59.005600000000008},{"$f":"D4+E4","v":1534.1456000000001},{"$f":"F4*$G$2","v":113.52677439999999},{"$f":"F4*$H$2","v":122.73164800000001},{"$f":"D4*$I$2","v":0},{"$f":"SUM(F4:I4)","v":1770.4040224},{"$f":"J4*$K$2","v":442.60100560000001},{"$f":"SUM(J4:K4)","v":2213.005028},{"$f":"L4/$M$2","v":14.140607207667731}]
[10,1,"10/1",1503.01,60.120400000000004,1563.1304,115.67164959999999,125.050432,0,1803.8524815999999,450.96312039999998,2254.8156019999997,14.407767424920126]
[10,2,"10/2",1530.87,61.2348,1592.1047999999998,117.81575519999998,127.36838399999999,0,1837.2889391999997,459.32223479999993,2296.6111739999997,14.674831782747601]
[10,3,"10/3",1590.46,63.618400000000001,1654.0784000000001,122.4018016,132.32627200000002,0,1908.8064736000001,477.20161840000003,2386.008092,15.246058095846646]
[10,4,"10/4",1648.73,65.949200000000005,1714.6792,126.8862608,137.17433600000001,0,1978.7397968,494.68494920000001,2473.4247460000001,15.804630964856232]
[15,0,"15/0",1648.73,65.949200000000005,1714.6792,126.8862608,137.17433600000001,0,1978.7397968,494.68494920000001,2473.4247460000001,15.804630964856232]
[15,1,"15/1",1680.44,67.217600000000004,1747.6576,129.3266624,139.81260800000001,0,2016.7968704,504.1992176,2520.9960879999999,16.108601201277953]
{"$rows_left_out":174}
{"sheet":"Data CAO GGZ 2019 (verbergen)","index":16,"n_rows":183,"n_cols":13,"rows_kept":183,"cut":false,"hidden":true,"merged":[]}
["Cao GGZ schalen per 1-1-2019"]
[null,null,null,null,0,null,8.3299999999999999E-2,0.08,1.7500000000000002E-2,null,{"$f":"17%+8%","v":0.25},null,{"$f":"1878/12","v":156.5}]
["Funct.schaal","Trede","Samengesteld","Salaris","Verhoging","Nieuw salaris","EJU","Vak toeslag","LFB","Brutoloon","Soc.lasten + pens.pr.","Tot incl soc lst + pens.pr.","Uurloon"]
[10,0,{"$f":"CONCATENATE(A4,\"/\",B4)","v":"10/0"},1571,{"$f":"D4*$E$2","v":0},{"$f":"D4+E4","v":1571},{"$f":"F4*$G$2","v":130.86429999999999},{"$f":"F4*$H$2","v":125.68},{"$f":"D4*$I$2","v":27.492500000000003},{"$f":"SUM(F4:I4)","v":1855.0368000000001},{"$f":"J4*$K$2","v":463.75920000000002},{"$f":"SUM(J4:K4)","v":2318.7960000000003},{"$f":"L4/$M$2","v":14.816587859424923}]
[10,1,"10/1",1629,0,1629,135.69569999999999,130.32,28.507500000000004,1923.5231999999999,480.88079999999997,2404.404,15.363603833865815]
[10,2,"10/2",1660,0,1660,138.27799999999999,132.80000000000001,29.050000000000004,1960.1279999999999,490.03199999999998,2450.16,15.655974440894568]
[10,3,"10/3",1704,0,1704,141.94319999999999,136.32,29.820000000000004,2012.0831999999998,503.02079999999995,2515.1039999999998,16.070952076677315]
[10,4,"10/4",1748,0,1748,145.60839999999999,139.84,30.590000000000003,2064.0383999999999,516.00959999999998,2580.0479999999998,16.485929712460063]
[10,5,"10/5",1793,0,1793,149.3569,143.44,31.377500000000001,2117.1743999999999,529.29359999999997,2646.4679999999998,16.910338658146962]
[10,6,"10/6",1843,0,1843,153.52189999999999,147.44,32.252500000000005,2176.2143999999998,544.05359999999996,2720.268,17.381904153354633]
{"$rows_left_out":173}