{"text_format":"1","workbook":"xlsx","n_sheets":17,"sheets":["Invulinstructie","1. Voorblad","2. Cliënt(en)","3. Uren zorg","4. Berekening","5. Doelen","6. Motivatie","7. Overige opmerkingen","8. Verhuisformulier","9. Rekenhulp ma-vr","10. Rekenhulp za-zo","11. Versiebeheer","Data (verbergen)","Data CAO 2019 (verbergen)","Data CAO GHZ 2019 (verbergen)","Data CAO VVT 2019 (verbergen)","Data CAO GGZ 2019 (verbergen)"],"not_rendered":{"charts":0,"images":1,"macros":0,"external_links":0,"defined_names":6,"comments":0,"pivot_tables":0},"unopened":[],"bounds":{"document_bytes":16777216,"sheet_cells":100000,"rows_first":2000,"rows_last":500,"rows_between":2000,"halvings":0,"cell_chars":16384,"cell_head_chars":4096},"cells_cut":0,"cells_raw":0,"read":"whole","date_system":"1900"}

{"sheet":"Invulinstructie","index":0,"n_rows":24,"n_cols":2,"rows_kept":24,"cut":false,"hidden":false,"merged":[[21,1,21,2],[23,1,23,2],[7,1,7,2],[5,1,5,2],[9,1,9,2],[11,1,11,2],[15,1,15,2],[17,1,17,2],[19,1,19,2],[13,1,13,2]]}
[]
[null,"Invulinstructie"]
[]
[]
[]
[null,"Start"]
[]
[null,"Dit sjabloon is een onderdeel van de aanvraag voor meerzorgtoekenning aan een intramuraal wonende cliënt (ZZP of VPT).\nDit sjabloon geldt voor alle meerzorgaanvragen, zowel individueel als in groepsverband; voor cliënten die eerder geen meerzorgtoekenning hebben én voor heraanvragen.\nBij (her-)aanvragen gebaseerd op gedragsproblematiek, zal het zorgkantoor na beoordeling van dit sjabloon besluiten of een verdere inhoudelijke toetsing door het CCE uitgevoerd mag worden.\n\nGebruik altijd per cliënt of cliëntgroep een recent, nieuw en leeg sjabloon.\nAlle lichtblauwe velden zijn invulbaar of via een rolmenu te benaderen."]
[]
[null,"Voorblad"]
[]
[null,"Vul alle lichtblauwe cellen in. Indien een verplichte cel niet of foutief wordt ingevuld dan wordt deze rood.\nWitte velden worden automatisch gevuld en of berekend.\n\nOnderteken het formulier (is tevens akkoord cliënt c.q. cliëntvertegenwoordiger, akkoordverklaring in cliëntdossier)."]
[]
[null,"Cliënt(en)"]
[]
[null,"Afhankelijk van de keuze voor een individuele of groepsaanvraag, zal er één respectievelijk 15 cliëntregels te zien zijn.\n\nEr zitten controles op een juiste BSN-nummer, logische data en het correcte Nza-product.\nLet op dat bij de indicatie ook de dagbesteding en behandeling aan of uit wordt gezet.\nIndien fout dan kleurt de cel rood.\n\nHet BSN-nummer kan via \"Plakken speciaal, als waarde\" ingevoegd worden.\nDatumnotatie is volgens dd-mm-jjjj, bijvoorbeeld 15-3-2002."]
[]
[null,"Uren zorg"]
[]
[null,"Uren worden ingevuld volgens uren:minuten, bijvoorbeeld 5:00 of 1:30.\nUren worden op weekbasis ingevuld.\nRestposturen en minuren moeten worden toegelicht bij de overige opmerkingen.\n\nLet op: indien een cliënt vanuit een woonsituatie ook dagbesteding ontvangt (vanuit de woning), dient ook de dagbestedingscomponent ingevuld te worden.\n\nIndien een cliënt meerzorgwaardig is, kleurt deze groen.\nIndien niet meerzorgwaardig, kleurt deze rood en wordt niet verder in berekening meegenomen.\nMeerzorgwaardig is een cliënt welke aan de voorwaarden voldoet én\nwaarvan de zorg boven de drempelvan de zzp-/vpt-waarde komt."]
[]
[null,"Berekening"]
[]
[null,"Afhankelijk van de keuze voor welke sector is gekozen, wordt op basis van de vastgestelde normbedragen een berekening gemaakt.\n\nBij de indirecte kosten kunnen jaarbedragen worden opgenomen. Deze dienen te worden voorzien van een omschrijving en bij de overige opmerkingen te worden toegelicht.\n\nIndien er geen fouten zijn in het sjabloon, wordt uiteindelijk het etmaalbedrag per cliënt berekend.\n\nVan de totale kosten zorg wordt uiteindelijk het loon-deel uit het VPT/ZZP-tarief afgetrokken. Het bedrag wat overblijft wordt daarna berekend per meerzorgwaardige client per etmaal."]

{"sheet":"1. Voorblad","index":1,"n_rows":38,"n_cols":14,"rows_kept":38,"cut":false,"hidden":false,"merged":[[0,1,0,2],[21,5,21,6],[25,1,25,2],[1,1,1,5],[31,1,34,2],[25,5,25,6]]}
[null,"Alleen een verhuizing doorgeven? Klik hier!",null,null,null,null,null,null,"vanaf hier verbergen"]
[null,"Sjabloon Aanvraag Meerzorg 2019"]
[]
[null,"Wlz-zorgaanbieder"]
[null,null,null,"cat.","nr."]
[null,"Registratienummer NZa",null,300]
[null,null,null,null,null,null,"© 2019 Zorgverzekeraars Nederland"]
[null,"AGB-code",null,null,null,null,"Versie 2019.03"]
[]
[null,"Zorgaanbieder",null,null,null,"Zorgkantoor"]
[]
[null,"Naam",{"$f":"IFERROR(VLOOKUP(E6,'Data (verbergen)'!A:E,2,0),\"\")","v":""},null,null,"Rechtspersoon",{"$f":"IFERROR(VLOOKUP(E6,'Data (verbergen)'!A:E,4,0),\"\")","v":""}]
[null,"Plaats",null,null,null,"Zorgkantoor",{"$f":"IFERROR(VLOOKUP(E6,'Data (verbergen)'!A:E,5,0),\"\")","v":""}]
[null,"Contactpersoon",null,null,null,"Contactpersoon"]
[null,"Telefoon",null,null,null,"Telefoon"]
[null,"Email",null,null,null,"Email"]
[null,null,null,null,null,null,null,null,null,null,null,null,{"$f":"'2. Cliënt(en)'!AH40","v":0},"Controle Nza"]
[null,"Afgesproken tarief-% zorgkantoor",null,null,null,"Voor welke sector vraagt de WLZ aanbieder meerzorg aan?",null,null,null,"cao",null,{"$f":"IF(C19=\"\",\"FOUT\",\"\")","v":"FOUT"},{"$f":"IF(L18=\"FOUT\",1,0)","v":1},"Controle tarief%"]
[null,null,null,null,null,null,null,null,null,{"$f":"IFERROR(VLOOKUP(G19,'Data (verbergen)'!G25:H27,2,0),0)","v":0},null,{"$f":"IF(C22=\"\",\"FOUT\",\"\")","v":"FOUT"},1,"Controle type"]
[null,null,{"$f":"IF(C19>100%,\"Percentage is maximaal 100%\",\"\")","v":""},null,null,null,null,null,null,null,null,{"$f":"IF(G19=\"\",\"FOUT\",\"\")","v":"FOUT"},1,"Controle cao"]
[null,"Geef aan om welk type aanvraag het gaat",null,null,null,"Geef aan om welke soort aanvraag het gaat",null,null,null,null,null,{"$f":"IF(F22=\"\",\"FOUT\",\"\")","v":"FOUT"},1,"Controle soort"]
[null,null,null,null,null,null,null,null,null,"aanvraag",{"$f":"IF(C22='Data (verbergen)'!G8,1,IF(C22='Data (verbergen)'!G9,2,0))","v":0},null,{"$f":"SUM(M17:M21)","v":4}]
[null,{"$f":"IF(C22=\"Meervoudige aanvraag (groepsmeerzorg)\",\"Groepsnaam\",\"\")","v":""}]
[]
[null,"Aantal cliënten",null,null,null,"Aantal cliënten dat in aanmerking komt voor meerzorg"]
[]
[]
[null,"Door ondertekening van het sjabloon verklaart zorgaanbieder:"]
[null,null,"- dat de opgegeven tijden en de daaruit voortvloeiende bedragen reëel zijn;"]
[null,null,"- dat de te ontvangen gelden worden ingezet ten behoeve van de betreffende cliënt(en) en niet aan andere doeleinden zullen worden besteed."]
[]
[null,"(handtekening)"]
[]
[]
[]
[]
[null,"Naam",null,null,null,null,"Totaal jaarbedrag procedure Meerzorg 2019"]
[null,"Datum",null,null,null,null,{"$f":"IF('4. Berekening'!P41>0,'4. Berekening'!P41,0)","v":0}]

{"sheet":"2. Cliënt(en)","index":2,"n_rows":40,"n_cols":34,"rows_kept":40,"cut":false,"hidden":false,"merged":[[5,21,7,21]]}
[null,null,null,null,null,null,null,null,null,null,null,null,null,null,null,null,null,null,null,null,null,null,null,"vanaf hier verbergen"]
[null,null,null,"Overzicht Cliënt(en)"]
[null,null,null,"Let op: datumnotatie is dd-mm-jj"]
[]
[]
[null,null,null,null,null,null,null,null,null,null,null,null,null,null,null,null,null,null,null,null,null,"Indien van toepassing: CCE-verklaring\ngeldig tot"]
[]
[null,null,null,"Naam cliënt",null,"Geboorte-\ndatum",null,"BSN",null,"Geïndiceerd\nZZP",null,"Dagbesteding\nvan toepassing?\nJa/Nee",null,"Behandeling\nvan toepassing?\nJa/Nee",null,"Prestatie-\ncode\nNZA",null,"Datum\nopname",null,"Beoogde\ningang",null,null,null,null,null,null,null,null,"Codering","Etmaal","NZA-jaar","Aanbieder","Geldig BSN","Geldig NZA"]
[]
[null,1,null,null,null,null,null,null,null,null,null,null,null,null,null,null,null,null,null,null,null,null,null,null,null,null,null,null,{"$f":"CONCATENATE(J10,N10,L10)","v":""},{"$f":"IFERROR(VLOOKUP(AC10,'Data (verbergen)'!O:T,4,0),0)","v":0},{"$f":"IF('3. Uren zorg'!AO11=1,'2. Cliënt(en)'!AD10*365,0)","v":0},{"$f":"AE10","v":0},{"$f":"IF((MOD(SUM({9;8;7;6;5;4;3;2;-1}*MID(TEXT(H10,\"000000000\"),{1;2;3;4;5;6;7;8;9},1)),11)=0),\"geldig\",\"ongeldig\")","v":"geldig"},{"$f":"IF(P10=\"Niet geldig\",1,0)","v":0}]
[]
[null,2,null,null,null,null,null,null,null,null,null,null,null,null,null,null,null,null,null,null,null,null,null,null,null,{"$f":"IF('1. Voorblad'!C22='Data (verbergen)'!G8,1,0)","v":0},null,null,{"$f":"CONCATENATE(J12,N12,L12)","v":""},{"$f":"IFERROR(VLOOKUP(AC12,'Data (verbergen)'!O:T,4,0),0)","v":0},{"$f":"IF('3. Uren zorg'!AO13=1,'2. Cliënt(en)'!AD12*365,0)","v":0},{"$f":"AE12","v":0},{"$f":"IF((MOD(SUM({9;8;7;6;5;4;3;2;-1}*MID(TEXT(H12,\"000000000\"),{1;2;3;4;5;6;7;8;9},1)),11)=0),\"geldig\",\"ongeldig\")","v":"geldig"},{"$f":"IF(P12=\"Niet geldig\",1,0)","v":0}]
[]
[null,3,null,null,null,null,null,null,null,null,null,null,null,null,null,{"$f":"IF(AC14<>\"\",IFERROR((VLOOKUP(AC14,'Data (verbergen)'!O:T,3,0)),\"Niet geldig\"),\"\")","v":""},null,null,null,null,null,null,null,null,null,"controle enkel/groep",null,null,{"$f":"CONCATENATE(J14,N14,L14)","v":""},{"$f":"IFERROR(VLOOKUP(AC14,'Data (verbergen)'!O:T,4,0),0)","v":0},{"$f":"IF('3. Uren zorg'!AO15=1,'2. Cliënt(en)'!AD14*365,0)","v":0},{"$f":"AE14","v":0},{"$f":"IF((MOD(SUM({9;8;7;6;5;4;3;2;-1}*MID(TEXT(H14,\"000000000\"),{1;2;3;4;5;6;7;8;9},1)),11)=0),\"geldig\",\"ongeldig\")","v":"geldig"},{"$f":"IF(P14=\"Niet geldig\",1,0)","v":0}]
[]
[null,4,null,null,null,null,null,null,null,null,null,null,null,null,null,{"$f":"IF(AC16<>\"\",IFERROR((VLOOKUP(AC16,'Data (verbergen)'!O:T,3,0)),\"Niet geldig\"),\"\")","v":""},null,null,null,null,null,null,null,null,null,"2019-01-01",null,null,{"$f":"CONCATENATE(J16,N16,L16)","v":""},{"$f":"IFERROR(VLOOKUP(AC16,'Data (verbergen)'!O:T,4,0),0)","v":0},{"$f":"IF('3. Uren zorg'!AO17=1,'2. Cliënt(en)'!AD16*365,0)","v":0},{"$f":"AE16","v":0},{"$f":"IF((MOD(SUM({9;8;7;6;5;4;3;2;-1}*MID(TEXT(H16,\"000000000\"),{1;2;3;4;5;6;7;8;9},1)),11)=0),\"geldig\",\"ongeldig\")","v":"geldig"},{"$f":"IF(P16=\"Niet geldig\",1,0)","v":0}]
[]
[null,5,null,null,null,null,null,null,null,null,null,null,null,null,null,{"$f":"IF(AC18<>\"\",IFERROR((VLOOKUP(AC18,'Data (verbergen)'!O:T,3,0)),\"Niet geldig\"),\"\")","v":""},null,null,null,null,null,null,null,null,null,"Controle opname",null,null,{"$f":"CONCATENATE(J18,N18,L18)","v":""},{"$f":"IFERROR(VLOOKUP(AC18,'Data (verbergen)'!O:T,4,0),0)","v":0},{"$f":"IF('3. Uren zorg'!AO19=1,'2. Cliënt(en)'!AD18*365,0)","v":0},{"$f":"AE18","v":0},{"$f":"IF((MOD(SUM({9;8;7;6;5;4;3;2;-1}*MID(TEXT(H18,\"000000000\"),{1;2;3;4;5;6;7;8;9},1)),11)=0),\"geldig\",\"ongeldig\")","v":"geldig"},{"$f":"IF(P18=\"Niet geldig\",1,0)","v":0}]
[]
[null,6,null,null,null,null,null,null,null,null,null,null,null,null,null,{"$f":"IF(AC20<>\"\",IFERROR((VLOOKUP(AC20,'Data (verbergen)'!O:T,3,0)),\"Niet geldig\"),\"\")","v":""},null,null,null,null,null,null,null,null,null,"2018-12-31",null,null,{"$f":"CONCATENATE(J20,N20,L20)","v":""},{"$f":"IFERROR(VLOOKUP(AC20,'Data (verbergen)'!O:T,4,0),0)","v":0},{"$f":"IF('3. Uren zorg'!AO21=1,'2. Cliënt(en)'!AD20*365,0)","v":0},{"$f":"AE20","v":0},{"$f":"IF((MOD(SUM({9;8;7;6;5;4;3;2;-1}*MID(TEXT(H20,\"000000000\"),{1;2;3;4;5;6;7;8;9},1)),11)=0),\"geldig\",\"ongeldig\")","v":"geldig"},{"$f":"IF(P20=\"Niet geldig\",1,0)","v":0}]
[]
[null,7,null,null,null,null,null,null,null,null,null,null,null,null,null,{"$f":"IF(AC22<>\"\",IFERROR((VLOOKUP(AC22,'Data (verbergen)'!O:T,3,0)),\"Niet geldig\"),\"\")","v":""},null,null,null,null,null,null,null,null,null,"Controle ingang",null,null,{"$f":"CONCATENATE(J22,N22,L22)","v":""},{"$f":"IFERROR(VLOOKUP(AC22,'Data (verbergen)'!O:T,4,0),0)","v":0},{"$f":"IF('3. Uren zorg'!AO23=1,'2. Cliënt(en)'!AD22*365,0)","v":0},{"$f":"AE22","v":0},{"$f":"IF((MOD(SUM({9;8;7;6;5;4;3;2;-1}*MID(TEXT(H22,\"000000000\"),{1;2;3;4;5;6;7;8;9},1)),11)=0),\"geldig\",\"ongeldig\")","v":"geldig"},{"$f":"IF(P22=\"Niet geldig\",1,0)","v":0}]
[]
[null,8,null,null,null,null,null,null,null,null,null,null,null,null,null,{"$f":"IF(AC24<>\"\",IFERROR((VLOOKUP(AC24,'Data (verbergen)'!O:T,3,0)),\"Niet geldig\"),\"\")","v":""},null,null,null,null,null,null,null,null,null,"2020-01-01",null,null,{"$f":"CONCATENATE(J24,N24,L24)","v":""},{"$f":"IFERROR(VLOOKUP(AC24,'Data (verbergen)'!O:T,4,0),0)","v":0},{"$f":"IF('3. Uren zorg'!AO25=1,'2. Cliënt(en)'!AD24*365,0)","v":0},{"$f":"AE24","v":0},{"$f":"IF((MOD(SUM({9;8;7;6;5;4;3;2;-1}*MID(TEXT(H24,\"000000000\"),{1;2;3;4;5;6;7;8;9},1)),11)=0),\"geldig\",\"ongeldig\")","v":"geldig"},{"$f":"IF(P24=\"Niet geldig\",1,0)","v":0}]
[]
[null,9,null,null,null,null,null,null,null,null,null,null,null,null,null,{"$f":"IF(AC26<>\"\",IFERROR((VLOOKUP(AC26,'Data (verbergen)'!O:T,3,0)),\"Niet geldig\"),\"\")","v":""},null,null,null,null,null,null,null,null,null,"Controle leeftijd",null,null,{"$f":"CONCATENATE(J26,N26,L26)","v":""},{"$f":"IFERROR(VLOOKUP(AC26,'Data (verbergen)'!O:T,4,0),0)","v":0},{"$f":"IF('3. Uren zorg'!AO27=1,'2. Cliënt(en)'!AD26*365,0)","v":0},{"$f":"AE26","v":0},{"$f":"IF((MOD(SUM({9;8;7;6;5;4;3;2;-1}*MID(TEXT(H26,\"000000000\"),{1;2;3;4;5;6;7;8;9},1)),11)=0),\"geldig\",\"ongeldig\")","v":"geldig"},{"$f":"IF(P26=\"Niet geldig\",1,0)","v":0}]
[]
[null,10,null,null,null,null,null,null,null,null,null,null,null,null,null,{"$f":"IF(AC28<>\"\",IFERROR((VLOOKUP(AC28,'Data (verbergen)'!O:T,3,0)),\"Niet geldig\"),\"\")","v":""},null,null,null,null,null,null,null,null,null,null,null,null,{"$f":"CONCATENATE(J28,N28,L28)","v":""},{"$f":"IFERROR(VLOOKUP(AC28,'Data (verbergen)'!O:T,4,0),0)","v":0},{"$f":"IF('3. Uren zorg'!AO29=1,'2. Cliënt(en)'!AD28*365,0)","v":0},{"$f":"AE28","v":0},{"$f":"IF((MOD(SUM({9;8;7;6;5;4;3;2;-1}*MID(TEXT(H28,\"000000000\"),{1;2;3;4;5;6;7;8;9},1)),11)=0),\"geldig\",\"ongeldig\")","v":"geldig"},{"$f":"IF(P28=\"Niet geldig\",1,0)","v":0}]
[]
[null,11,null,null,null,null,null,null,null,null,null,null,null,null,null,{"$f":"IF(AC30<>\"\",IFERROR((VLOOKUP(AC30,'Data (verbergen)'!O:T,3,0)),\"Niet geldig\"),\"\")","v":""},null,null,null,null,null,null,null,null,null,null,null,null,{"$f":"CONCATENATE(J30,N30,L30)","v":""},{"$f":"IFERROR(VLOOKUP(AC30,'Data (verbergen)'!O:T,4,0),0)","v":0},{"$f":"IF('3. Uren zorg'!AO31=1,'2. Cliënt(en)'!AD30*365,0)","v":0},{"$f":"AE30","v":0},{"$f":"IF((MOD(SUM({9;8;7;6;5;4;3;2;-1}*MID(TEXT(H30,\"000000000\"),{1;2;3;4;5;6;7;8;9},1)),11)=0),\"geldig\",\"ongeldig\")","v":"geldig"},{"$f":"IF(P30=\"Niet geldig\",1,0)","v":0}]
[]
[null,12,null,null,null,null,null,null,null,null,null,null,null,null,null,{"$f":"IF(AC32<>\"\",IFERROR((VLOOKUP(AC32,'Data (verbergen)'!O:T,3,0)),\"Niet geldig\"),\"\")","v":""},null,null,null,null,null,null,null,null,null,null,null,null,{"$f":"CONCATENATE(J32,N32,L32)","v":""},{"$f":"IFERROR(VLOOKUP(AC32,'Data (verbergen)'!O:T,4,0),0)","v":0},{"$f":"IF('3. Uren zorg'!AO33=1,'2. Cliënt(en)'!AD32*365,0)","v":0},{"$f":"AE32","v":0},{"$f":"IF((MOD(SUM({9;8;7;6;5;4;3;2;-1}*MID(TEXT(H32,\"000000000\"),{1;2;3;4;5;6;7;8;9},1)),11)=0),\"geldig\",\"ongeldig\")","v":"geldig"},{"$f":"IF(P32=\"Niet geldig\",1,0)","v":0}]
[]
[null,13,null,null,null,null,null,null,null,null,null,null,null,null,null,{"$f":"IF(AC34<>\"\",IFERROR((VLOOKUP(AC34,'Data (verbergen)'!O:T,3,0)),\"Niet geldig\"),\"\")","v":""},null,null,null,null,null,null,null,null,null,null,null,null,{"$f":"CONCATENATE(J34,N34,L34)","v":""},{"$f":"IFERROR(VLOOKUP(AC34,'Data (verbergen)'!O:T,4,0),0)","v":0},{"$f":"IF('3. Uren zorg'!AO35=1,'2. Cliënt(en)'!AD34*365,0)","v":0},{"$f":"AE34","v":0},{"$f":"IF((MOD(SUM({9;8;7;6;5;4;3;2;-1}*MID(TEXT(H34,\"000000000\"),{1;2;3;4;5;6;7;8;9},1)),11)=0),\"geldig\",\"ongeldig\")","v":"geldig"},{"$f":"IF(P34=\"Niet geldig\",1,0)","v":0}]
[]
[null,14,null,null,null,null,null,null,null,null,null,null,null,null,null,{"$f":"IF(AC36<>\"\",IFERROR((VLOOKUP(AC36,'Data (verbergen)'!O:T,3,0)),\"Niet geldig\"),\"\")","v":""},null,null,null,null,null,null,null,null,null,null,null,null,{"$f":"CONCATENATE(J36,N36,L36)","v":""},{"$f":"IFERROR(VLOOKUP(AC36,'Data (verbergen)'!O:T,4,0),0)","v":0},{"$f":"IF('3. Uren zorg'!AO37=1,'2. Cliënt(en)'!AD36*365,0)","v":0},{"$f":"AE36","v":0},{"$f":"IF((MOD(SUM({9;8;7;6;5;4;3;2;-1}*MID(TEXT(H36,\"000000000\"),{1;2;3;4;5;6;7;8;9},1)),11)=0),\"geldig\",\"ongeldig\")","v":"geldig"},{"$f":"IF(P36=\"Niet geldig\",1,0)","v":0}]
[]
[null,15,null,null,null,null,null,null,null,null,null,null,null,null,null,{"$f":"IF(AC38<>\"\",IFERROR((VLOOKUP(AC38,'Data (verbergen)'!O:T,3,0)),\"Niet geldig\"),\"\")","v":""},null,null,null,null,null,null,null,null,null,null,null,null,{"$f":"CONCATENATE(J38,N38,L38)","v":""},{"$f":"IFERROR(VLOOKUP(AC38,'Data (verbergen)'!O:T,4,0),0)","v":0},{"$f":"IF('3. Uren zorg'!AO39=1,'2. Cliënt(en)'!AD38*365,0)","v":0},{"$f":"AE38","v":0},{"$f":"IF((MOD(SUM({9;8;7;6;5;4;3;2;-1}*MID(TEXT(H38,\"000000000\"),{1;2;3;4;5;6;7;8;9},1)),11)=0),\"geldig\",\"ongeldig\")","v":"geldig"},{"$f":"IF(P38=\"Niet geldig\",1,0)","v":0}]
[]
[null,"vanaf hier verbergen",null,null,null,null,null,null,null,null,null,null,null,null,null,null,null,null,null,null,null,null,null,null,null,null,null,null,null,null,{"$f":"SUM(AE10:AE38)","v":0},0,null,{"$f":"SUM(AH10:AH38)","v":0}]

{"sheet":"3. Uren zorg","index":3,"n_rows":41,"n_cols":63,"rows_kept":41,"cut":false,"hidden":false,"merged":[[6,47,6,50],[6,43,6,46],[6,51,6,54],[6,59,6,62],[6,55,6,58],[6,15,6,17],[1,3,1,32],[6,21,6,27],[6,9,6,11],[6,5,6,7],[6,31,6,35]]}
[null,null,null,null,null,null,null,null,null,null,null,null,null,null,null,null,null,null,null,null,null,null,null,null,null,null,null,null,null,null,null,null,null,null,null,null,null,null,null,"vanaf hier verbergen"]
[null,null,null,"Uren zorg"]
[null,null,null,"Let op: urennotatie is uu:mm",null,null,null,null,null,null,null,null,null,null,null,null,null,null,null,null,null,null,null,null,null,null,null,null,null,null,null,null,null,null,null,null,null,null,null,null,null,null,"Controle uren"]
[null,null,null,null,null,null,null,null,null,null,null,null,null,null,null,null,null,null,null,null,null,null,null,null,null,null,null,null,null,null,null,null,null,null,null,null,null,null,null,null,null,null,"23:59:00"]
[null,null,null,null,null,null,null,null,null,null,null,null,null,null,null,null,null,null,null,null,null,null,null,null,null,null,null,null,null,null,null,null,null,null,null,null,null,null,null,null,null,null,null,null,null,null,null,null,null,null,null,null,1.25,null,null,null,0.1]
[]
[null,null,null,null,null,"Wonen ma-vr",null,null,null,"Wonen za-zo",null,null,null,null,null,"Dagbesteding",null,null,null,null,null,"Behandeling (uren per week)",null,null,null,null,null,null,null,null,null,"Overig (uren per week)",null,null,null,null,null,null,null,null,null,null,null,"Rekenkundig",null,null,null,"Uren ZZP",null,null,null,"Drempel",null,null,null,"Saldo",null,null,null,"T.b.v. berekening"]
[]
[null,null,null,"Naam cliënt",null,"Uren\nper dag",null,"Dagen\nper week",null,"Uren\nper dag",null,"Dagen\nper week",null,"Totaal\nWonen",null,"Uren\nper dag",null,"Dagen\nper week",null,"Totaal\nDagbs.",null,"Gedrags-\ndeskundige",null,"Psychiater",null,"Arts",null,"Overig",null,"Totaal\nBehan.",null,"Nacht-\nopvang",null,"Restpost\nuren*",null,"Min\nuren**",null,"Meerzorgwaardig?",null,null,null,"Wonen","Dagbesteding","Wonen","Dagbesteding","Behandeling","Totaal","Wonen","Dagbesteding","Behandeling","Totaal","Wonen","Dagbesteding","Behandeling","Totaal","Wonen","Dagbesteding","Behandeling","Totaal","Wonen","Dagbesteding","Behandeling","Totaal"]
[]
[null,1,null,{"$f":"IF('2. Cliënt(en)'!D10<>0,'2. Cliënt(en)'!D10,\"\")","v":""},null,null,null,null,null,null,null,null,null,{"$f":"(F11*H11)+(J11*L11)","v":0},null,null,null,null,null,{"$f":"P11*R11","v":0},null,null,null,null,null,null,null,null,null,{"$f":"V11+X11+Z11+AB11","v":0},null,null,null,null,null,null,null,{"$f":"BG11","v":0},null,{"$f":"IF(D11<>\"\",1,0)","v":0},{"$f":"IF(AL11>0,1,0)","v":0},{"$f":"(F11*H11)+(J11*L11)+AF11+AH11-AJ11","v":0},{"$f":"P11*R11","v":0},{"$f":"IF(AV11>0,AP11*24,0)","v":0},0,{"$f":"IF(AX11>0,(V11+X11+Z11+AB11)*24,0)","v":0},{"$f":"AR11+AS11+AT11","v":0},{"$f":"IFERROR(VLOOKUP('2. Cliënt(en)'!J10,'Data (verbergen)'!I:M,2,0),0)","v":0},{"$f":"IFERROR(IF('2. Cliënt(en)'!L10=\"Ja\",VLOOKUP('2. Cliënt(en)'!J10,'Data (verbergen)'!I:M,3,0),0),0)","v":0},{"$f":"IFERROR(IF('2. Cliënt(en)'!N10=\"Ja\",VLOOKUP('2. Cliënt(en)'!J10,'Data (verbergen)'!I:M,4,0),0),0)","v":0},{"$f":"SUM(AV11:AX11)","v":0},{"$f":"AV11*$BA$5","v":0},0,0,{"$f":"SUM(AZ11:BB11)","v":0},{"$f":"(AV11*$BE$5)+(AR11-AZ11)","v":0},0,0,{"$f":"IF(AND('2. Cliënt(en)'!D10<>\"\",'2. Cliënt(en)'!J10<>\"\"),SUM(BD11:BF11),0)","v":0},{"$f":"IF(AO11=1,AR11,0)","v":0},{"$f":"IF(AO11=1,AS11,0)","v":0},{"$f":"IF(AO11=1,AT11,0)","v":0},{"$f":"SUM(BH11:BJ11)","v":0}]
[]
[null,2,null,{"$f":"IF('2. Cliënt(en)'!D12<>0,'2. Cliënt(en)'!D12,\"\")","v":""},null,null,null,null,null,null,null,null,null,{"$f":"(F13*H13)+(J13*L13)","v":0},null,null,null,null,null,{"$f":"P13*R13","v":0},null,null,null,null,null,null,null,null,null,{"$f":"V13+X13+Z13+AB13","v":0},null,null,null,null,null,null,null,{"$f":"BG13","v":0},null,{"$f":"IF(D13<>\"\",1,0)","v":0},{"$f":"IF(AL13>0,1,0)","v":0},{"$f":"(F13*H13)+(J13*L13)+AF13+AH13-AJ13","v":0},{"$f":"P13*R13","v":0},{"$f":"IF(AV13>0,AP13*24,0)","v":0},0,{"$f":"IF(AX13>0,(V13+X13+Z13+AB13)*24,0)","v":0},{"$f":"AR13+AS13+AT13","v":0},{"$f":"IFERROR(VLOOKUP('2. Cliënt(en)'!J12,'Data (verbergen)'!I:M,2,0),0)","v":0},{"$f":"IFERROR(IF('2. Cliënt(en)'!L12=\"Ja\",VLOOKUP('2. Cliënt(en)'!J12,'Data (verbergen)'!I:M,3,0),0),0)","v":0},{"$f":"IFERROR(IF('2. Cliënt(en)'!N12=\"Ja\",VLOOKUP('2. Cliënt(en)'!J12,'Data (verbergen)'!I:M,4,0),0),0)","v":0},{"$f":"SUM(AV13:AX13)","v":0},{"$f":"AV13*$BA$5","v":0},0,0,{"$f":"SUM(AZ13:BB13)","v":0},{"$f":"(AV13*$BE$5)+(AR13-AZ13)","v":0},0,0,{"$f":"IF(AND('2. Cliënt(en)'!D12<>\"\",'2. Cliënt(en)'!J12<>\"\"),SUM(BD13:BF13),0)","v":0},{"$f":"IF(AO13=1,AR13,0)","v":0},{"$f":"IF(AO13=1,AS13,0)","v":0},{"$f":"IF(AO13=1,AT13,0)","v":0},{"$f":"SUM(BH13:BJ13)","v":0}]
[]
[null,3,null,{"$f":"IF('2. Cliënt(en)'!D14<>0,'2. Cliënt(en)'!D14,\"\")","v":""},null,null,null,null,null,null,null,null,null,{"$f":"(F15*H15)+(J15*L15)","v":0},null,null,null,null,null,{"$f":"P15*R15","v":0},null,null,null,null,null,null,null,null,null,{"$f":"V15+X15+Z15+AB15","v":0},null,null,null,null,null,null,null,{"$f":"BG15","v":0},null,{"$f":"IF(D15<>\"\",1,0)","v":0},{"$f":"IF(AL15>0,1,0)","v":0},{"$f":"(F15*H15)+(J15*L15)+AF15+AH15-AJ15","v":0},{"$f":"P15*R15","v":0},{"$f":"IF(AV15>0,AP15*24,0)","v":0},0,{"$f":"IF(AX15>0,(V15+X15+Z15+AB15)*24,0)","v":0},{"$f":"AR15+AS15+AT15","v":0},{"$f":"IFERROR(VLOOKUP('2. Cliënt(en)'!J14,'Data (verbergen)'!I:M,2,0),0)","v":0},{"$f":"IFERROR(IF('2. Cliënt(en)'!L14=\"Ja\",VLOOKUP('2. Cliënt(en)'!J14,'Data (verbergen)'!I:M,3,0),0),0)","v":0},{"$f":"IFERROR(IF('2. Cliënt(en)'!N14=\"Ja\",VLOOKUP('2. Cliënt(en)'!J14,'Data (verbergen)'!I:M,4,0),0),0)","v":0},{"$f":"SUM(AV15:AX15)","v":0},{"$f":"AV15*$BA$5","v":0},0,0,{"$f":"SUM(AZ15:BB15)","v":0},{"$f":"(AV15*$BE$5)+(AR15-AZ15)","v":0},0,0,{"$f":"IF(AND('2. Cliënt(en)'!D14<>\"\",'2. Cliënt(en)'!J14<>\"\"),SUM(BD15:BF15),0)","v":0},{"$f":"IF(AO15=1,AR15,0)","v":0},{"$f":"IF(AO15=1,AS15,0)","v":0},{"$f":"IF(AO15=1,AT15,0)","v":0},{"$f":"SUM(BH15:BJ15)","v":0}]
[]
[null,4,null,{"$f":"IF('2. Cliënt(en)'!D16<>0,'2. Cliënt(en)'!D16,\"\")","v":""},null,null,null,null,null,null,null,null,null,{"$f":"(F17*H17)+(J17*L17)","v":0},null,null,null,null,null,{"$f":"P17*R17","v":0},null,null,null,null,null,null,null,null,null,{"$f":"V17+X17+Z17+AB17","v":0},null,null,null,null,null,null,null,{"$f":"BG17","v":0},null,{"$f":"IF(D17<>\"\",1,0)","v":0},{"$f":"IF(AL17>0,1,0)","v":0},{"$f":"(F17*H17)+(J17*L17)+AF17+AH17-AJ17","v":0},{"$f":"P17*R17","v":0},{"$f":"IF(AV17>0,AP17*24,0)","v":0},0,{"$f":"IF(AX17>0,(V17+X17+Z17+AB17)*24,0)","v":0},{"$f":"AR17+AS17+AT17","v":0},{"$f":"IFERROR(VLOOKUP('2. Cliënt(en)'!J16,'Data (verbergen)'!I:M,2,0),0)","v":0},{"$f":"IFERROR(IF('2. Cliënt(en)'!L16=\"Ja\",VLOOKUP('2. Cliënt(en)'!J16,'Data (verbergen)'!I:M,3,0),0),0)","v":0},{"$f":"IFERROR(IF('2. Cliënt(en)'!N16=\"Ja\",VLOOKUP('2. Cliënt(en)'!J16,'Data (verbergen)'!I:M,4,0),0),0)","v":0},{"$f":"SUM(AV17:AX17)","v":0},{"$f":"AV17*$BA$5","v":0},0,0,{"$f":"SUM(AZ17:BB17)","v":0},{"$f":"(AV17*$BE$5)+(AR17-AZ17)","v":0},0,0,{"$f":"IF(AND('2. Cliënt(en)'!D16<>\"\",'2. Cliënt(en)'!J16<>\"\"),SUM(BD17:BF17),0)","v":0},{"$f":"IF(AO17=1,AR17,0)","v":0},{"$f":"IF(AO17=1,AS17,0)","v":0},{"$f":"IF(AO17=1,AT17,0)","v":0},{"$f":"SUM(BH17:BJ17)","v":0}]
[]
[null,5,null,{"$f":"IF('2. Cliënt(en)'!D18<>0,'2. Cliënt(en)'!D18,\"\")","v":""},null,null,null,null,null,null,null,null,null,{"$f":"(F19*H19)+(J19*L19)","v":0},null,null,null,null,null,{"$f":"P19*R19","v":0},null,null,null,null,null,null,null,null,null,{"$f":"V19+X19+Z19+AB19","v":0},null,null,null,null,null,null,null,{"$f":"BG19","v":0},null,{"$f":"IF(D19<>\"\",1,0)","v":0},{"$f":"IF(AL19>0,1,0)","v":0},{"$f":"(F19*H19)+(J19*L19)+AF19+AH19-AJ19","v":0},{"$f":"P19*R19","v":0},{"$f":"IF(AV19>0,AP19*24,0)","v":0},0,{"$f":"IF(AX19>0,(V19+X19+Z19+AB19)*24,0)","v":0},{"$f":"AR19+AS19+AT19","v":0},{"$f":"IFERROR(VLOOKUP('2. Cliënt(en)'!J18,'Data (verbergen)'!I:M,2,0),0)","v":0},{"$f":"IFERROR(IF('2. Cliënt(en)'!L18=\"Ja\",VLOOKUP('2. Cliënt(en)'!J18,'Data (verbergen)'!I:M,3,0),0),0)","v":0},{"$f":"IFERROR(IF('2. Cliënt(en)'!N18=\"Ja\",VLOOKUP('2. Cliënt(en)'!J18,'Data (verbergen)'!I:M,4,0),0),0)","v":0},{"$f":"SUM(AV19:AX19)","v":0},{"$f":"AV19*$BA$5","v":0},0,0,{"$f":"SUM(AZ19:BB19)","v":0},{"$f":"(AV19*$BE$5)+(AR19-AZ19)","v":0},0,0,{"$f":"IF(AND('2. Cliënt(en)'!D18<>\"\",'2. Cliënt(en)'!J18<>\"\"),SUM(BD19:BF19),0)","v":0},{"$f":"IF(AO19=1,AR19,0)","v":0},{"$f":"IF(AO19=1,AS19,0)","v":0},{"$f":"IF(AO19=1,AT19,0)","v":0},{"$f":"SUM(BH19:BJ19)","v":0}]
[]
[null,6,null,{"$f":"IF('2. Cliënt(en)'!D20<>0,'2. Cliënt(en)'!D20,\"\")","v":""},null,null,null,null,null,null,null,null,null,{"$f":"(F21*H21)+(J21*L21)","v":0},null,null,null,null,null,{"$f":"P21*R21","v":0},null,null,null,null,null,null,null,null,null,{"$f":"V21+X21+Z21+AB21","v":0},null,null,null,null,null,null,null,{"$f":"BG21","v":0},null,{"$f":"IF(D21<>\"\",1,0)","v":0},{"$f":"IF(AL21>0,1,0)","v":0},{"$f":"(F21*H21)+(J21*L21)+AF21+AH21-AJ21","v":0},{"$f":"P21*R21","v":0},{"$f":"IF(AV21>0,AP21*24,0)","v":0},0,{"$f":"IF(AX21>0,(V21+X21+Z21+AB21)*24,0)","v":0},{"$f":"AR21+AS21+AT21","v":0},{"$f":"IFERROR(VLOOKUP('2. Cliënt(en)'!J20,'Data (verbergen)'!I:M,2,0),0)","v":0},{"$f":"IFERROR(IF('2. Cliënt(en)'!L20=\"Ja\",VLOOKUP('2. Cliënt(en)'!J20,'Data (verbergen)'!I:M,3,0),0),0)","v":0},{"$f":"IFERROR(IF('2. Cliënt(en)'!N20=\"Ja\",VLOOKUP('2. Cliënt(en)'!J20,'Data (verbergen)'!I:M,4,0),0),0)","v":0},{"$f":"SUM(AV21:AX21)","v":0},{"$f":"AV21*$BA$5","v":0},0,0,{"$f":"SUM(AZ21:BB21)","v":0},{"$f":"(AV21*$BE$5)+(AR21-AZ21)","v":0},0,0,{"$f":"IF(AND('2. Cliënt(en)'!D20<>\"\",'2. Cliënt(en)'!J20<>\"\"),SUM(BD21:BF21),0)","v":0},{"$f":"IF(AO21=1,AR21,0)","v":0},{"$f":"IF(AO21=1,AS21,0)","v":0},{"$f":"IF(AO21=1,AT21,0)","v":0},{"$f":"SUM(BH21:BJ21)","v":0}]
[]
[null,7,null,{"$f":"IF('2. Cliënt(en)'!D22<>0,'2. Cliënt(en)'!D22,\"\")","v":""},null,null,null,null,null,null,null,null,null,{"$f":"(F23*H23)+(J23*L23)","v":0},null,null,null,null,null,{"$f":"P23*R23","v":0},null,null,null,null,null,null,null,null,null,{"$f":"V23+X23+Z23+AB23","v":0},null,null,null,null,null,null,null,{"$f":"BG23","v":0},null,{"$f":"IF(D23<>\"\",1,0)","v":0},{"$f":"IF(AL23>0,1,0)","v":0},{"$f":"(F23*H23)+(J23*L23)+AF23+AH23-AJ23","v":0},{"$f":"P23*R23","v":0},{"$f":"IF(AV23>0,AP23*24,0)","v":0},0,{"$f":"IF(AX23>0,(V23+X23+Z23+AB23)*24,0)","v":0},{"$f":"AR23+AS23+AT23","v":0},{"$f":"IFERROR(VLOOKUP('2. Cliënt(en)'!J22,'Data (verbergen)'!I:M,2,0),0)","v":0},{"$f":"IFERROR(IF('2. Cliënt(en)'!L22=\"Ja\",VLOOKUP('2. Cliënt(en)'!J22,'Data (verbergen)'!I:M,3,0),0),0)","v":0},{"$f":"IFERROR(IF('2. Cliënt(en)'!N22=\"Ja\",VLOOKUP('2. Cliënt(en)'!J22,'Data (verbergen)'!I:M,4,0),0),0)","v":0},{"$f":"SUM(AV23:AX23)","v":0},{"$f":"AV23*$BA$5","v":0},0,0,{"$f":"SUM(AZ23:BB23)","v":0},{"$f":"(AV23*$BE$5)+(AR23-AZ23)","v":0},0,0,{"$f":"IF(AND('2. Cliënt(en)'!D22<>\"\",'2. Cliënt(en)'!J22<>\"\"),SUM(BD23:BF23),0)","v":0},{"$f":"IF(AO23=1,AR23,0)","v":0},{"$f":"IF(AO23=1,AS23,0)","v":0},{"$f":"IF(AO23=1,AT23,0)","v":0},{"$f":"SUM(BH23:BJ23)","v":0}]
[]
[null,8,null,{"$f":"IF('2. Cliënt(en)'!D24<>0,'2. Cliënt(en)'!D24,\"\")","v":""},null,null,null,null,null,null,null,null,null,{"$f":"(F25*H25)+(J25*L25)","v":0},null,null,null,null,null,{"$f":"P25*R25","v":0},null,null,null,null,null,null,null,null,null,{"$f":"V25+X25+Z25+AB25","v":0},null,null,null,null,null,null,null,{"$f":"BG25","v":0},null,{"$f":"IF(D25<>\"\",1,0)","v":0},{"$f":"IF(AL25>0,1,0)","v":0},{"$f":"(F25*H25)+(J25*L25)+AF25+AH25-AJ25","v":0},{"$f":"P25*R25","v":0},{"$f":"IF(AV25>0,AP25*24,0)","v":0},0,{"$f":"IF(AX25>0,(V25+X25+Z25+AB25)*24,0)","v":0},{"$f":"AR25+AS25+AT25","v":0},{"$f":"IFERROR(VLOOKUP('2. Cliënt(en)'!J24,'Data (verbergen)'!I:M,2,0),0)","v":0},{"$f":"IFERROR(IF('2. Cliënt(en)'!L24=\"Ja\",VLOOKUP('2. Cliënt(en)'!J24,'Data (verbergen)'!I:M,3,0),0),0)","v":0},{"$f":"IFERROR(IF('2. Cliënt(en)'!N24=\"Ja\",VLOOKUP('2. Cliënt(en)'!J24,'Data (verbergen)'!I:M,4,0),0),0)","v":0},{"$f":"SUM(AV25:AX25)","v":0},{"$f":"AV25*$BA$5","v":0},0,0,{"$f":"SUM(AZ25:BB25)","v":0},{"$f":"(AV25*$BE$5)+(AR25-AZ25)","v":0},0,0,{"$f":"IF(AND('2. Cliënt(en)'!D24<>\"\",'2. Cliënt(en)'!J24<>\"\"),SUM(BD25:BF25),0)","v":0},{"$f":"IF(AO25=1,AR25,0)","v":0},{"$f":"IF(AO25=1,AS25,0)","v":0},{"$f":"IF(AO25=1,AT25,0)","v":0},{"$f":"SUM(BH25:BJ25)","v":0}]
[]
[null,9,null,{"$f":"IF('2. Cliënt(en)'!D26<>0,'2. Cliënt(en)'!D26,\"\")","v":""},null,null,null,null,null,null,null,null,null,{"$f":"(F27*H27)+(J27*L27)","v":0},null,null,null,null,null,{"$f":"P27*R27","v":0},null,null,null,null,null,null,null,null,null,{"$f":"V27+X27+Z27+AB27","v":0},null,null,null,null,null,null,null,{"$f":"BG27","v":0},null,{"$f":"IF(D27<>\"\",1,0)","v":0},{"$f":"IF(AL27>0,1,0)","v":0},{"$f":"(F27*H27)+(J27*L27)+AF27+AH27-AJ27","v":0},{"$f":"P27*R27","v":0},{"$f":"IF(AV27>0,AP27*24,0)","v":0},0,{"$f":"IF(AX27>0,(V27+X27+Z27+AB27)*24,0)","v":0},{"$f":"AR27+AS27+AT27","v":0},{"$f":"IFERROR(VLOOKUP('2. Cliënt(en)'!J26,'Data (verbergen)'!I:M,2,0),0)","v":0},{"$f":"IFERROR(IF('2. Cliënt(en)'!L26=\"Ja\",VLOOKUP('2. Cliënt(en)'!J26,'Data (verbergen)'!I:M,3,0),0),0)","v":0},{"$f":"IFERROR(IF('2. Cliënt(en)'!N26=\"Ja\",VLOOKUP('2. Cliënt(en)'!J26,'Data (verbergen)'!I:M,4,0),0),0)","v":0},{"$f":"SUM(AV27:AX27)","v":0},{"$f":"AV27*$BA$5","v":0},0,0,{"$f":"SUM(AZ27:BB27)","v":0},{"$f":"(AV27*$BE$5)+(AR27-AZ27)","v":0},0,0,{"$f":"IF(AND('2. Cliënt(en)'!D26<>\"\",'2. Cliënt(en)'!J26<>\"\"),SUM(BD27:BF27),0)","v":0},{"$f":"IF(AO27=1,AR27,0)","v":0},{"$f":"IF(AO27=1,AS27,0)","v":0},{"$f":"IF(AO27=1,AT27,0)","v":0},{"$f":"SUM(BH27:BJ27)","v":0}]
[]
[null,10,null,{"$f":"IF('2. Cliënt(en)'!D28<>0,'2. Cliënt(en)'!D28,\"\")","v":""},null,null,null,null,null,null,null,null,null,{"$f":"(F29*H29)+(J29*L29)","v":0},null,null,null,null,null,{"$f":"P29*R29","v":0},null,null,null,null,null,null,null,null,null,{"$f":"V29+X29+Z29+AB29","v":0},null,null,null,null,null,null,null,{"$f":"BG29","v":0},null,{"$f":"IF(D29<>\"\",1,0)","v":0},{"$f":"IF(AL29>0,1,0)","v":0},{"$f":"(F29*H29)+(J29*L29)+AF29+AH29-AJ29","v":0},{"$f":"P29*R29","v":0},{"$f":"IF(AV29>0,AP29*24,0)","v":0},0,{"$f":"IF(AX29>0,(V29+X29+Z29+AB29)*24,0)","v":0},{"$f":"AR29+AS29+AT29","v":0},{"$f":"IFERROR(VLOOKUP('2. Cliënt(en)'!J28,'Data (verbergen)'!I:M,2,0),0)","v":0},{"$f":"IFERROR(IF('2. Cliënt(en)'!L28=\"Ja\",VLOOKUP('2. Cliënt(en)'!J28,'Data (verbergen)'!I:M,3,0),0),0)","v":0},{"$f":"IFERROR(IF('2. Cliënt(en)'!N28=\"Ja\",VLOOKUP('2. Cliënt(en)'!J28,'Data (verbergen)'!I:M,4,0),0),0)","v":0},{"$f":"SUM(AV29:AX29)","v":0},{"$f":"AV29*$BA$5","v":0},0,0,{"$f":"SUM(AZ29:BB29)","v":0},{"$f":"(AV29*$BE$5)+(AR29-AZ29)","v":0},0,0,{"$f":"IF(AND('2. Cliënt(en)'!D28<>\"\",'2. Cliënt(en)'!J28<>\"\"),SUM(BD29:BF29),0)","v":0},{"$f":"IF(AO29=1,AR29,0)","v":0},{"$f":"IF(AO29=1,AS29,0)","v":0},{"$f":"IF(AO29=1,AT29,0)","v":0},{"$f":"SUM(BH29:BJ29)","v":0}]
[]
[null,11,null,{"$f":"IF('2. Cliënt(en)'!D30<>0,'2. Cliënt(en)'!D30,\"\")","v":""},null,null,null,null,null,null,null,null,null,{"$f":"(F31*H31)+(J31*L31)","v":0},null,null,null,null,null,{"$f":"P31*R31","v":0},null,null,null,null,null,null,null,null,null,{"$f":"V31+X31+Z31+AB31","v":0},null,null,null,null,null,null,null,{"$f":"BG31","v":0},null,{"$f":"IF(D31<>\"\",1,0)","v":0},{"$f":"IF(AL31>0,1,0)","v":0},{"$f":"(F31*H31)+(J31*L31)+AF31+AH31-AJ31","v":0},{"$f":"P31*R31","v":0},{"$f":"IF(AV31>0,AP31*24,0)","v":0},0,{"$f":"IF(AX31>0,(V31+X31+Z31+AB31)*24,0)","v":0},{"$f":"AR31+AS31+AT31","v":0},{"$f":"IFERROR(VLOOKUP('2. Cliënt(en)'!J30,'Data (verbergen)'!I:M,2,0),0)","v":0},{"$f":"IFERROR(IF('2. Cliënt(en)'!L30=\"Ja\",VLOOKUP('2. Cliënt(en)'!J30,'Data (verbergen)'!I:M,3,0),0),0)","v":0},{"$f":"IFERROR(IF('2. Cliënt(en)'!N30=\"Ja\",VLOOKUP('2. Cliënt(en)'!J30,'Data (verbergen)'!I:M,4,0),0),0)","v":0},{"$f":"SUM(AV31:AX31)","v":0},{"$f":"AV31*$BA$5","v":0},0,0,{"$f":"SUM(AZ31:BB31)","v":0},{"$f":"(AV31*$BE$5)+(AR31-AZ31)","v":0},0,0,{"$f":"IF(AND('2. Cliënt(en)'!D30<>\"\",'2. Cliënt(en)'!J30<>\"\"),SUM(BD31:BF31),0)","v":0},{"$f":"IF(AO31=1,AR31,0)","v":0},{"$f":"IF(AO31=1,AS31,0)","v":0},{"$f":"IF(AO31=1,AT31,0)","v":0},{"$f":"SUM(BH31:BJ31)","v":0}]
[]
[null,12,null,{"$f":"IF('2. Cliënt(en)'!D32<>0,'2. Cliënt(en)'!D32,\"\")","v":""},null,null,null,null,null,null,null,null,null,{"$f":"(F33*H33)+(J33*L33)","v":0},null,null,null,null,null,{"$f":"P33*R33","v":0},null,null,null,null,null,null,null,null,null,{"$f":"V33+X33+Z33+AB33","v":0},null,null,null,null,null,null,null,{"$f":"BG33","v":0},null,{"$f":"IF(D33<>\"\",1,0)","v":0},{"$f":"IF(AL33>0,1,0)","v":0},{"$f":"(F33*H33)+(J33*L33)+AF33+AH33-AJ33","v":0},{"$f":"P33*R33","v":0},{"$f":"IF(AV33>0,AP33*24,0)","v":0},0,{"$f":"IF(AX33>0,(V33+X33+Z33+AB33)*24,0)","v":0},{"$f":"AR33+AS33+AT33","v":0},{"$f":"IFERROR(VLOOKUP('2. Cliënt(en)'!J32,'Data (verbergen)'!I:M,2,0),0)","v":0},{"$f":"IFERROR(IF('2. Cliënt(en)'!L32=\"Ja\",VLOOKUP('2. Cliënt(en)'!J32,'Data (verbergen)'!I:M,3,0),0),0)","v":0},{"$f":"IFERROR(IF('2. Cliënt(en)'!N32=\"Ja\",VLOOKUP('2. Cliënt(en)'!J32,'Data (verbergen)'!I:M,4,0),0),0)","v":0},{"$f":"SUM(AV33:AX33)","v":0},{"$f":"AV33*$BA$5","v":0},0,0,{"$f":"SUM(AZ33:BB33)","v":0},{"$f":"(AV33*$BE$5)+(AR33-AZ33)","v":0},0,0,{"$f":"IF(AND('2. Cliënt(en)'!D32<>\"\",'2. Cliënt(en)'!J32<>\"\"),SUM(BD33:BF33),0)","v":0},{"$f":"IF(AO33=1,AR33,0)","v":0},{"$f":"IF(AO33=1,AS33,0)","v":0},{"$f":"IF(AO33=1,AT33,0)","v":0},{"$f":"SUM(BH33:BJ33)","v":0}]
[]
[null,13,null,{"$f":"IF('2. Cliënt(en)'!D34<>0,'2. Cliënt(en)'!D34,\"\")","v":""},null,null,null,null,null,null,null,null,null,{"$f":"(F35*H35)+(J35*L35)","v":0},null,null,null,null,null,{"$f":"P35*R35","v":0},null,null,null,null,null,null,null,null,null,{"$f":"V35+X35+Z35+AB35","v":0},null,null,null,null,null,null,null,{"$f":"BG35","v":0},null,{"$f":"IF(D35<>\"\",1,0)","v":0},{"$f":"IF(AL35>0,1,0)","v":0},{"$f":"(F35*H35)+(J35*L35)+AF35+AH35-AJ35","v":0},{"$f":"P35*R35","v":0},{"$f":"IF(AV35>0,AP35*24,0)","v":0},0,{"$f":"IF(AX35>0,(V35+X35+Z35+AB35)*24,0)","v":0},{"$f":"AR35+AS35+AT35","v":0},{"$f":"IFERROR(VLOOKUP('2. Cliënt(en)'!J34,'Data (verbergen)'!I:M,2,0),0)","v":0},{"$f":"IFERROR(IF('2. Cliënt(en)'!L34=\"Ja\",VLOOKUP('2. Cliënt(en)'!J34,'Data (verbergen)'!I:M,3,0),0),0)","v":0},{"$f":"IFERROR(IF('2. Cliënt(en)'!N34=\"Ja\",VLOOKUP('2. Cliënt(en)'!J34,'Data (verbergen)'!I:M,4,0),0),0)","v":0},{"$f":"SUM(AV35:AX35)","v":0},{"$f":"AV35*$BA$5","v":0},0,0,{"$f":"SUM(AZ35:BB35)","v":0},{"$f":"(AV35*$BE$5)+(AR35-AZ35)","v":0},0,0,{"$f":"IF(AND('2. Cliënt(en)'!D34<>\"\",'2. Cliënt(en)'!J34<>\"\"),SUM(BD35:BF35),0)","v":0},{"$f":"IF(AO35=1,AR35,0)","v":0},{"$f":"IF(AO35=1,AS35,0)","v":0},{"$f":"IF(AO35=1,AT35,0)","v":0},{"$f":"SUM(BH35:BJ35)","v":0}]
[]
[null,14,null,{"$f":"IF('2. Cliënt(en)'!D36<>0,'2. Cliënt(en)'!D36,\"\")","v":""},null,null,null,null,null,null,null,null,null,{"$f":"(F37*H37)+(J37*L37)","v":0},null,null,null,null,null,{"$f":"P37*R37","v":0},null,null,null,null,null,null,null,null,null,{"$f":"V37+X37+Z37+AB37","v":0},null,null,null,null,null,null,null,{"$f":"BG37","v":0},null,{"$f":"IF(D37<>\"\",1,0)","v":0},{"$f":"IF(AL37>0,1,0)","v":0},{"$f":"(F37*H37)+(J37*L37)+AF37+AH37-AJ37","v":0},{"$f":"P37*R37","v":0},{"$f":"IF(AV37>0,AP37*24,0)","v":0},0,{"$f":"IF(AX37>0,(V37+X37+Z37+AB37)*24,0)","v":0},{"$f":"AR37+AS37+AT37","v":0},{"$f":"IFERROR(VLOOKUP('2. Cliënt(en)'!J36,'Data (verbergen)'!I:M,2,0),0)","v":0},{"$f":"IFERROR(IF('2. Cliënt(en)'!L36=\"Ja\",VLOOKUP('2. Cliënt(en)'!J36,'Data (verbergen)'!I:M,3,0),0),0)","v":0},{"$f":"IFERROR(IF('2. Cliënt(en)'!N36=\"Ja\",VLOOKUP('2. Cliënt(en)'!J36,'Data (verbergen)'!I:M,4,0),0),0)","v":0},{"$f":"SUM(AV37:AX37)","v":0},{"$f":"AV37*$BA$5","v":0},0,0,{"$f":"SUM(AZ37:BB37)","v":0},{"$f":"(AV37*$BE$5)+(AR37-AZ37)","v":0},0,0,{"$f":"IF(AND('2. Cliënt(en)'!D36<>\"\",'2. Cliënt(en)'!J36<>\"\"),SUM(BD37:BF37),0)","v":0},{"$f":"IF(AO37=1,AR37,0)","v":0},{"$f":"IF(AO37=1,AS37,0)","v":0},{"$f":"IF(AO37=1,AT37,0)","v":0},{"$f":"SUM(BH37:BJ37)","v":0}]
[]
[null,15,null,{"$f":"IF('2. Cliënt(en)'!D38<>0,'2. Cliënt(en)'!D38,\"\")","v":""},null,null,null,null,null,null,null,null,null,{"$f":"(F39*H39)+(J39*L39)","v":0},null,null,null,null,null,{"$f":"P39*R39","v":0},null,null,null,null,null,null,null,null,null,{"$f":"V39+X39+Z39+AB39","v":0},null,null,null,null,null,null,null,{"$f":"BG39","v":0},null,{"$f":"IF(D39<>\"\",1,0)","v":0},{"$f":"IF(AL39>0,1,0)","v":0},{"$f":"(F39*H39)+(J39*L39)+AF39+AH39-AJ39","v":0},{"$f":"P39*R39","v":0},{"$f":"IF(AV39>0,AP39*24,0)","v":0},0,{"$f":"IF(AX39>0,(V39+X39+Z39+AB39)*24,0)","v":0},{"$f":"AR39+AS39+AT39","v":0},{"$f":"IFERROR(VLOOKUP('2. Cliënt(en)'!J38,'Data (verbergen)'!I:M,2,0),0)","v":0},{"$f":"IFERROR(IF('2. Cliënt(en)'!L38=\"Ja\",VLOOKUP('2. Cliënt(en)'!J38,'Data (verbergen)'!I:M,3,0),0),0)","v":0},{"$f":"IFERROR(IF('2. Cliënt(en)'!N38=\"Ja\",VLOOKUP('2. Cliënt(en)'!J38,'Data (verbergen)'!I:M,4,0),0),0)","v":0},{"$f":"SUM(AV39:AX39)","v":0},{"$f":"AV39*$BA$5","v":0},0,0,{"$f":"SUM(AZ39:BB39)","v":0},{"$f":"(AV39*$BE$5)+(AR39-AZ39)","v":0},0,0,{"$f":"IF(AND('2. Cliënt(en)'!D38<>\"\",'2. Cliënt(en)'!J38<>\"\"),SUM(BD39:BF39),0)","v":0},{"$f":"IF(AO39=1,AR39,0)","v":0},{"$f":"IF(AO39=1,AS39,0)","v":0},{"$f":"IF(AO39=1,AT39,0)","v":0},{"$f":"SUM(BH39:BJ39)","v":0}]
[]
[null,null,null,null,null,null,null,null,null,null,null,null,null,null,null,null,null,null,null,null,null,null,null,null,null,null,null,null,null,null,null,null,null,null,null,null,null,null,null,{"$f":"SUM(AN11:AN39)","v":0},0,null,null,{"$f":"SUM(AR11:AR39)","v":0},0,0,0,0,0,0,0,0,0,0,0,0,0,0,0,0,0,0,0]

{"sheet":"4. Berekening","index":4,"n_rows":45,"n_cols":18,"rows_kept":45,"cut":false,"hidden":false,"merged":[[26,3,26,13],[28,3,28,13],[42,3,42,7],[44,3,44,13],[20,3,20,13],[24,3,24,13],[38,3,38,13],[36,3,36,13],[22,3,22,13],[40,3,40,13],[20,1,22,1],[10,3,10,5],[12,3,12,5],[14,3,14,5],[18,3,18,13]]}
[null,null,null,null,null,null,null,null,null,null,null,null,null,null,null,null,null,"vanaf hier verbergen"]
[null,"Berekening meerzorg"]
[]
[]
[]
[]
[null,"Directe zorgkosten"]
[]
[null,null,null,null,null,null,null,"Uren\nzorg",null,"Uren\nzzp",null,"Uren\nmeerzorg",null,{"$f":"CONCATENATE(\"Normbedrag \", '1. Voorblad'!G19)","v":"Normbedrag "},null,"Jaarbedrag"]
[]
[null,null,null,"Wonen",null,null,null,{"$f":"'3. Uren zorg'!BH41","v":0},null,{"$f":"'3. Uren zorg'!AV41","v":0},null,{"$f":"H11-J11","v":0},null,{"$f":"IFERROR(VLOOKUP('1. Voorblad'!G19,'Data (verbergen)'!AL2:AO4,4,0),0)","v":0},null,{"$f":"IFERROR((H11*52.142857)*N11,0)","v":0}]
[]
[null,null,null,"Dagbesteding",null,null,null,{"$f":"'3. Uren zorg'!BI41","v":0},null,{"$f":"'3. Uren zorg'!AW41","v":0},null,{"$f":"H13-J13","v":0},null,{"$f":"IFERROR(VLOOKUP('1. Voorblad'!G19,'Data (verbergen)'!AL6:AO8,4,0),0)","v":0},null,{"$f":"IFERROR((H13*52.14)*N13,0)","v":0}]
[]
[null,null,null,"Behandeling",null,null,null,{"$f":"'3. Uren zorg'!BJ41","v":0},null,{"$f":"'3. Uren zorg'!AX41","v":0},null,{"$f":"H15-J15","v":0},null,{"$f":"IFERROR(VLOOKUP('1. Voorblad'!G19,'Data (verbergen)'!AL10:AO12,4,0),0)","v":0},null,{"$f":"IFERROR((H15*52.14)*N15,0)","v":0}]
[]
[null,null,null,null,null,null,null,null,null,null,null,null,null,null,null,{"$f":"SUM(P11:P15)","v":0}]
[]
[null,"Indirecte zorgkosten",null,"Omschrijving",null,null,null,null,null,null,null,null,null,null,null,"Bedrag"]
[]
[null,"Toelichten op tabblad 7. Overige opmerkingen"]
[]
[]
[]
[]
[]
[]
[]
[]
[]
[null,null,null,null,null,null,null,null,null,null,null,null,null,null,null,{"$f":"SUM(P21:P29)","v":0}]
[]
[null,null,null,null,null,null,null,null,null,null,null,null,null,null,null,{"$f":"P17+P31","v":0}]
[]
[null,"Berekening meerzorg"]
[]
[null,null,null,"Af: ZZP/VPT-loonwaarde cliënt(en)",null,null,null,null,null,null,null,null,null,null,null,{"$f":"'2. Cliënt(en)'!AF40","v":0}]
[]
[null,null,null,"Bruto Jaarbedrag meerzorg",null,null,null,null,null,null,null,null,null,null,null,{"$f":"IF('1. Voorblad'!M22=0,P33-P37,0)","v":0}]
[]
[null,null,null,"Jaarbedrag meerzorg tegen afgesproken tarief",null,null,null,null,null,null,null,null,null,null,null,{"$f":"P39*'1. Voorblad'!C19","v":0}]
[]
[null,null,null,"Aantal meerzorgwaardige cliënten",null,null,null,null,null,null,null,null,null,{"$f":"'3. Uren zorg'!AO41","v":0}]
[]
[null,null,null,"Etmaalbedrag per meerzorgwaardige cliënt (ZMZ01)",null,null,null,null,null,null,null,null,null,null,null,{"$f":"IF(Q45<1250,ROUND(Q45,2),1250)","v":0},{"$f":"IF(P41<0,0,IFERROR((P41/N43)/365,0))","v":0}]

{"sheet":"5. Doelen","index":5,"n_rows":63,"n_cols":2,"rows_kept":63,"cut":false,"hidden":false,"merged":[[64,2,74,2],[9,2,18,2],[48,1,48,2],[62,1,62,2],[5,1,5,2],[7,1,7,2],[20,1,20,2],[34,1,34,2]]}
[]
[null,"Doelen"]
[]
[]
[]
[null,"In te vullen door zorgaanbieder"]
[]
[null,"Perspectief (schets het perspectief in het kader waarvan de hieronder genoemde doelen ingezet gaan worden)"]
[]
[]
[]
[]
[]
[]
[]
[]
[]
[]
[]
[]
[null,"Doelen (voor welke doelen vraagt u meerzorg aan? Formuleer ieder doel SMART)"]
[]
[null,1]
[]
[null,2]
[]
[null,3]
[]
[null,4]
[]
[null,5]
[]
[null,6]
[]
[null,"Werkwijze ( geef per gesteld doel aan, hoe u tot resultaat wilt komen)"]
[]
[null,1]
[]
[null,2]
[]
[null,3]
[]
[null,4]
[]
[null,5]
[]
[null,6]
[]
[null,"Evaluatie (geef per doelstelling concrete evaluatiecriteria aan )"]
[]
[null,1]
[]
[null,2]
[]
[null,3]
[]
[null,4]
[]
[null,5]
[]
[null,6]
[]
[null,"Afbouw (geef aan hoe de extra inzet kan worden afgebouwd)"]

{"sheet":"6. Motivatie","index":6,"n_rows":23,"n_cols":8,"rows_kept":23,"cut":false,"hidden":false,"merged":[[9,7,18,8],[22,7,31,8],[5,1,5,2],[7,1,7,2],[9,1,18,2],[20,1,20,2],[22,2,60,2]]}
[null,null,null,null,"Vanaf hier verbergen"]
[null,"Motivatie"]
[]
[]
[]
[null,"In te vullen door zorgaanbieder"]
[]
[null,{"$f":"CONCATENATE(B2,\" \",'1. Voorblad'!C22)","v":"Motivatie "}]
[]
[null,{"$f":"IF('1. Voorblad'!K22=1,H10,IF('1. Voorblad'!K22=2,H23,\"\"))","v":""},null,null,null,null,null,"Beantwoord in onderstaand veld, voor zover van toepassing, de onderstaande vragen:\n\n- Waarom past de zorgvraag van de cliënt niet binnen het zorgprofiel?\n- Waaruit blijkt de extreme zorgbehoefte?\n- Wat is de aanleiding van de meerzorg en wat is de frequentie?\n- Welke interventiemiddelen zijn er toe nu toe ingezet en met welk effect?\n- Is er een concrete vraag voor het CCE en zoja, wat is deze vraag?"]
[]
[]
[]
[]
[]
[]
[]
[]
[]
[]
[null,"Doelen (voor welke doelen vraagt u meerzorg aan? Formuleer ieder doel SMART)"]
[]
[null,null,null,null,null,null,null,"Beantwoord in onderstaand veld, voor zover van toepassing, de onderstaande vragen:\n\n- Wat is de reden dat er wordt gekozen voor groepsmeerzorg?\n- Waar bestaat de extra zorg uit?\n- Welke indirecte zorg is nodig en wat is de relatie tot de meerzorg?\n- Welke doelen staan er voor de komende periode centraal?\n- Wat is de nulmeting en wat moet behaald worden?\n- Is er een concrete vraag voor het CCE en zoja, wat is deze vraag?"]

{"sheet":"7. Overige opmerkingen","index":7,"n_rows":34,"n_cols":2,"rows_kept":34,"cut":false,"hidden":false,"merged":[[35,2,44,2],[33,1,33,2],[5,1,5,2],[7,1,7,2],[20,1,20,2],[9,2,18,2],[22,2,31,2]]}
[]
[null,"Overige opmerkingen"]
[]
[]
[]
[null,"In te vullen door zorgaanbieder"]
[]
[null,"Restpost- en minuren"]
[]
[]
[]
[]
[]
[]
[]
[]
[]
[]
[]
[]
[null,"Indirecte kosten"]
[]
[]
[]
[]
[]
[]
[]
[]
[]
[]
[]
[]
[null,"Overige opmerkingen"]

{"sheet":"8. Verhuisformulier","index":8,"n_rows":57,"n_cols":7,"rows_kept":57,"cut":false,"hidden":false,"merged":[[1,1,1,5],[56,5,60,6],[56,1,60,2],[50,5,54,6],[50,1,54,2]]}
[]
[null,"Verhuisformulier Meerzorg 2019"]
[]
[null,"Registratienummers Nza oude en nieuwe aanbieder"]
[null,null,null,"cat.","nr."]
[null,"Registratienummer Nza oude zorgaanbieder",null,300]
[]
[null,"Registratienummer Nza nieuwe zorgaanbieder",null,300]
[]
[null,"Gegevens OUDE Zorgaanbieder",null,null,null,"Gegevens OUD Zorgkantoor"]
[]
[null,"Naam",{"$f":"IFERROR(VLOOKUP(E6,'Data (verbergen)'!A:E,2,0),\"\")","v":""},null,null,"Rechtspersoon",{"$f":"IFERROR(VLOOKUP(E6,'Data (verbergen)'!A:E,4,0),\"\")","v":""}]
[null,"Plaats",{"$f":"IFERROR(VLOOKUP(E6,'Data (verbergen)'!A:E,3,0),\"\")","v":""},null,null,"Zorgkantoor",{"$f":"IFERROR(VLOOKUP(E6,'Data (verbergen)'!A:E,5,0),\"\")","v":""}]
[null,"Contactpersoon",null,null,null,"Contactpersoon"]
[null,"Telefoon",null,null,null,"Telefoon"]
[null,"Email",null,null,null,"Email"]
[]
[null,"Gegevens NIEUWE Zorgaanbieder",null,null,null,"Gegevens NIEUW Zorgkantoor"]
[]
[null,"Naam",{"$f":"IFERROR(VLOOKUP(E8,'Data (verbergen)'!A:E,2,0),\"\")","v":""},null,null,"Rechtspersoon",{"$f":"IFERROR(VLOOKUP(E8,'Data (verbergen)'!A:E,4,0),\"\")","v":""}]
[null,"Plaats",{"$f":"IFERROR(VLOOKUP(E8,'Data (verbergen)'!A:E,3,0),\"\")","v":""},null,null,"Zorgkantoor",{"$f":"IFERROR(VLOOKUP(E8,'Data (verbergen)'!A:E,5,0),\"\")","v":""}]
[null,"Contactpersoon",null,null,null,"Contactpersoon"]
[null,"Telefoon",null,null,null,"Telefoon"]
[null,"Email",null,null,null,"Email"]
[]
[null,"Cliëntgegevens"]
[]
[null,"Naam"]
[]
[null,"Geboortedatum"]
[]
[null,"Hoogte toeslag"]
[]
[null,"Verhuisdatum"]
[]
[null,"Uren woonzorg"]
[]
[null,"Uren dagbesteding"]
[]
[null,"Uren behandeling"]
[]
[null,"Door ondertekening van het formulier verklaren alle partijen:"]
[null,"          - dat bovengenomede client op vermelde datum is verhuisd naar de nieuwe zorgaanbieder;"]
[null,"          - dat het zorgplan integraal van de oude zorgaanbieder door de nieuwe zorgaanbieder is overgenomen."]
[null,"Is dit niet het geval, dan kan dit formulier niet worden gebruikt en zal de nieuwe zorgaanbieder een nieuw aanvraagtraject moeten doorlopen."]
[]
[null,"Let op:"]
[null,"Toeslagen kunnen alleen naar de nieuwe zorgaanbeider overgeheveld worden als het bedrag nog in de rekenstaat van de oude aanbieder is opgenomen."]
[null,"Mocht dit niet meer het geval zijn, dan zal de nieuwe zorgaanbieder een nieuw aanvraagtraject moeten doorlopen."]
[]
[null,"(handtekening oude aanbieder)",null,null,null,"(handtekening nieuwe aanbieder)"]
[]
[]
[]
[]
[]
[null,"(handtekening oud zorgkantoor)",null,null,null,"(handtekening nieuw zorgkantoor)"]

{"sheet":"9. Rekenhulp ma-vr","index":9,"n_rows":44,"n_cols":16,"rows_kept":44,"cut":false,"hidden":false,"merged":[[4,7,4,9],[5,7,5,9],[6,7,6,9],[7,7,7,9],[6,11,6,13],[7,11,7,13]]}
[]
[null,"Rekenhulp maandag-vrijdag"]
[null,"In te vullen per individuele cliënt"]
[]
[null,"Naam cliënt:"]
[null,"Woonlocatie:"]
[null,"Dagbestedingslocatie:",null,null,null,null,null,null,null,null,null,"Over te nemen bij wonen ma-vr",null,null,null,{"$f":"SUMIF($H$12:$H$44,\"Wonen\",$P$12:$P$44)","v":"00:00:00"}]
[null,"Ingevuld/opgesteld door:",null,null,null,null,null,null,null,null,null,"Over te nemen bij dagbesteding",null,null,null,{"$f":"SUMIF($H$12:$H$44,\"Dagbesteding\",$P$12:$P$44)","v":"00:00:00"}]
[]
[null,"Tijd van",null,"Tijd tot",null,"Uren",null,"Functie",null,"Activiteit (Wat)",null,"Begeleidingsstijl (Hoe)",null,"1 op …",null,"Formatie-\nuren"]
[]
[null,"07:00:00",null,null,null,{"$f":"IF(D12=\"\",0,D12-B12)","v":"00:00:00"},null,null,null,null,null,null,null,null,null,{"$f":"IFERROR(F12/N12,0)","v":"00:00:00"}]
[null,{"$f":"D12","v":"00:00:00"},null,null,null,{"$f":"IF(D13=\"\",0,D13-B13)","v":"00:00:00"},null,null,null,null,null,null,null,null,null,{"$f":"IFERROR(F13/N13,0)","v":"00:00:00"}]
[null,"00:00:00",null,null,null,"00:00:00",null,null,null,null,null,null,null,null,null,"00:00:00"]
[null,"00:00:00",null,null,null,"00:00:00",null,null,null,null,null,null,null,null,null,"00:00:00"]
[null,"00:00:00",null,null,null,"00:00:00",null,null,null,null,null,null,null,null,null,"00:00:00"]
[null,"00:00:00",null,null,null,"00:00:00",null,null,null,null,null,null,null,null,null,"00:00:00"]
[null,"00:00:00",null,null,null,"00:00:00",null,null,null,null,null,null,null,null,null,"00:00:00"]
[null,"00:00:00",null,null,null,"00:00:00",null,null,null,null,null,null,null,null,null,"00:00:00"]
[null,"00:00:00",null,null,null,"00:00:00",null,null,null,null,null,null,null,null,null,"00:00:00"]
[null,"00:00:00",null,null,null,"00:00:00",null,null,null,null,null,null,null,null,null,"00:00:00"]
[null,"00:00:00",null,null,null,"00:00:00",null,null,null,null,null,null,null,null,null,"00:00:00"]
[null,"00:00:00",null,null,null,"00:00:00",null,null,null,null,null,null,null,null,null,"00:00:00"]
[null,"00:00:00",null,null,null,"00:00:00",null,null,null,null,null,null,null,null,null,"00:00:00"]
[null,"00:00:00",null,null,null,"00:00:00",null,null,null,null,null,null,null,null,null,"00:00:00"]
[null,"00:00:00",null,null,null,"00:00:00",null,null,null,null,null,null,null,null,null,"00:00:00"]
[null,{"$f":"D26","v":"00:00:00"},null,null,null,{"$f":"IF(D27=\"\",0,D27-B27)","v":"00:00:00"},null,null,null,null,null,null,null,null,null,{"$f":"IFERROR(F27/N27,0)","v":"00:00:00"}]
[null,"00:00:00",null,null,null,"00:00:00",null,null,null,null,null,null,null,null,null,"00:00:00"]
[null,"00:00:00",null,null,null,"00:00:00",null,null,null,null,null,null,null,null,null,"00:00:00"]
[null,"00:00:00",null,null,null,"00:00:00",null,null,null,null,null,null,null,null,null,"00:00:00"]
[null,"00:00:00",null,null,null,"00:00:00",null,null,null,null,null,null,null,null,null,"00:00:00"]
[null,"00:00:00",null,null,null,"00:00:00",null,null,null,null,null,null,null,null,null,"00:00:00"]
[null,"00:00:00",null,null,null,"00:00:00",null,null,null,null,null,null,null,null,null,"00:00:00"]
[null,"00:00:00",null,null,null,"00:00:00",null,null,null,null,null,null,null,null,null,"00:00:00"]
[null,"00:00:00",null,null,null,"00:00:00",null,null,null,null,null,null,null,null,null,"00:00:00"]
[null,"00:00:00",null,null,null,"00:00:00",null,null,null,null,null,null,null,null,null,"00:00:00"]
[null,"00:00:00",null,null,null,"00:00:00",null,null,null,null,null,null,null,null,null,"00:00:00"]
[null,"00:00:00",null,null,null,"00:00:00",null,null,null,null,null,null,null,null,null,"00:00:00"]
[null,"00:00:00",null,null,null,"00:00:00",null,null,null,null,null,null,null,null,null,"00:00:00"]
[null,"00:00:00",null,null,null,"00:00:00",null,null,null,null,null,null,null,null,null,"00:00:00"]
[null,"00:00:00",null,null,null,"00:00:00",null,null,null,null,null,null,null,null,null,"00:00:00"]
[null,"00:00:00",null,null,null,"00:00:00",null,null,null,null,null,null,null,null,null,"00:00:00"]
[null,{"$f":"D42","v":"00:00:00"},null,null,null,{"$f":"IF(D43=\"\",0,D43-B43)","v":"00:00:00"},null,null,null,null,null,null,null,null,null,{"$f":"IFERROR(F43/N43,0)","v":"00:00:00"}]
[null,"00:00:00",null,null,null,"00:00:00",null,null,null,null,null,null,null,null,null,"00:00:00"]

{"sheet":"10. Rekenhulp za-zo","index":10,"n_rows":44,"n_cols":16,"rows_kept":44,"cut":false,"hidden":false,"merged":[[4,7,4,9],[5,7,5,9],[6,7,6,9],[6,11,6,13],[7,7,7,9],[7,11,7,13]]}
[]
[null,"Rekenhulp zaterdag-zondag"]
[null,"In te vullen per individuele cliënt"]
[]
[null,"Naam cliënt:"]
[null,"Woonlocatie:"]
[null,"Dagbestedingslocatie:",null,null,null,null,null,null,null,null,null,"Over te nemen bij wonen za-zo",null,null,null,{"$f":"SUMIF($H$12:$H$44,\"Wonen\",$P$12:$P$44)","v":"00:00:00"}]
[null,"Ingevuld/opgesteld door:"]
[]
[null,"Tijd van",null,"Tijd tot",null,"Uren",null,"Functie",null,"Activiteit (Wat)",null,"Begeleidingsstijl (Hoe)",null,"1 op …",null,"Formatie-\nuren"]
[]
[null,"07:00:00",null,null,null,{"$f":"IF(D12=\"\",0,D12-B12)","v":"00:00:00"},null,"Wonen",null,null,null,null,null,null,null,{"$f":"IFERROR(F12/N12,0)","v":"00:00:00"}]
[null,{"$f":"D12","v":"00:00:00"},null,null,null,{"$f":"IF(D13=\"\",0,D13-B13)","v":"00:00:00"},null,"Wonen",null,null,null,null,null,null,null,{"$f":"IFERROR(F13/N13,0)","v":"00:00:00"}]
[null,"00:00:00",null,null,null,"00:00:00",null,"Wonen",null,null,null,null,null,null,null,"00:00:00"]
[null,"00:00:00",null,null,null,"00:00:00",null,"Wonen",null,null,null,null,null,null,null,"00:00:00"]
[null,"00:00:00",null,null,null,"00:00:00",null,"Wonen",null,null,null,null,null,null,null,"00:00:00"]
[null,"00:00:00",null,null,null,"00:00:00",null,"Wonen",null,null,null,null,null,null,null,"00:00:00"]
[null,"00:00:00",null,null,null,"00:00:00",null,"Wonen",null,null,null,null,null,null,null,"00:00:00"]
[null,"00:00:00",null,null,null,"00:00:00",null,"Wonen",null,null,null,null,null,null,null,"00:00:00"]
[null,"00:00:00",null,null,null,"00:00:00",null,"Wonen",null,null,null,null,null,null,null,"00:00:00"]
[null,"00:00:00",null,null,null,"00:00:00",null,"Wonen",null,null,null,null,null,null,null,"00:00:00"]
[null,"00:00:00",null,null,null,"00:00:00",null,"Wonen",null,null,null,null,null,null,null,"00:00:00"]
[null,"00:00:00",null,null,null,"00:00:00",null,"Wonen",null,null,null,null,null,null,null,"00:00:00"]
[null,"00:00:00",null,null,null,"00:00:00",null,"Wonen",null,null,null,null,null,null,null,"00:00:00"]
[null,"00:00:00",null,null,null,"00:00:00",null,"Wonen",null,null,null,null,null,null,null,"00:00:00"]
[null,"00:00:00",null,null,null,"00:00:00",null,"Wonen",null,null,null,null,null,null,null,"00:00:00"]
[null,"00:00:00",null,null,null,"00:00:00",null,"Wonen",null,null,null,null,null,null,null,"00:00:00"]
[null,"00:00:00",null,null,null,"00:00:00",null,"Wonen",null,null,null,null,null,null,null,"00:00:00"]
[null,"00:00:00",null,null,null,"00:00:00",null,"Wonen",null,null,null,null,null,null,null,"00:00:00"]
[null,"00:00:00",null,null,null,"00:00:00",null,"Wonen",null,null,null,null,null,null,null,"00:00:00"]
[null,"00:00:00",null,null,null,"00:00:00",null,"Wonen",null,null,null,null,null,null,null,"00:00:00"]
[null,"00:00:00",null,null,null,"00:00:00",null,"Wonen",null,null,null,null,null,null,null,"00:00:00"]
[null,"00:00:00",null,null,null,"00:00:00",null,"Wonen",null,null,null,null,null,null,null,"00:00:00"]
[null,"00:00:00",null,null,null,"00:00:00",null,"Wonen",null,null,null,null,null,null,null,"00:00:00"]
[null,"00:00:00",null,null,null,"00:00:00",null,"Wonen",null,null,null,null,null,null,null,"00:00:00"]
[null,"00:00:00",null,null,null,"00:00:00",null,"Wonen",null,null,null,null,null,null,null,"00:00:00"]
[null,"00:00:00",null,null,null,"00:00:00",null,"Wonen",null,null,null,null,null,null,null,"00:00:00"]
[null,"00:00:00",null,null,null,"00:00:00",null,"Wonen",null,null,null,null,null,null,null,"00:00:00"]
[null,"00:00:00",null,null,null,"00:00:00",null,"Wonen",null,null,null,null,null,null,null,"00:00:00"]
[null,"00:00:00",null,null,null,"00:00:00",null,"Wonen",null,null,null,null,null,null,null,"00:00:00"]
[null,"00:00:00",null,null,null,"00:00:00",null,"Wonen",null,null,null,null,null,null,null,"00:00:00"]
[null,"00:00:00",null,null,null,"00:00:00",null,"Wonen",null,null,null,null,null,null,null,"00:00:00"]
[null,"00:00:00",null,null,null,"00:00:00",null,"Wonen",null,null,null,null,null,null,null,"00:00:00"]
[null,"00:00:00",null,null,null,"00:00:00",null,"Wonen",null,null,null,null,null,null,null,"00:00:00"]

{"sheet":"11. Versiebeheer","index":11,"n_rows":16,"n_cols":8,"rows_kept":16,"cut":false,"hidden":false,"merged":[]}
[]
[null,"Versiebeheer"]
[]
[]
[]
[]
[null,"Datum",null,"Versie",null,"Tabblad",null,"Opmerkingen/wijzigingen"]
[]
[null,"2018-11-09",null,"2019.01",null,null,null,"Publicatie"]
[]
[null,"2018-11-22",null,"2019.02",null,3,null,"Formulefout in tabblad 3. aangepast"]
[]
[null,"2018-12-20",null,"2019.03",null,1,null,"Lijst ZA-ZK geactualiseerd met Nza-gegevens"]
[null,null,null,null,null,3,null,"Uren behandeling en overig opengesteld voor meer dan 24 uur"]
[null,null,null,null,null,4,null,"Etmaalbedrag op juiste grondslag aangepast"]
[null,"2019-06-06",null,"2019.04",null,"divers",null,"Problemen met terugloop opgelost"]

{"sheet":"Data (verbergen)","index":12,"n_rows":1598,"n_cols":41,"rows_kept":1598,"cut":false,"hidden":true,"merged":[[0,0,0,4]]}
["Zoektabel ZA-ZK",null,null,null,null,null,"Soort problematiek",null,"Indicatie","WN","DB","BH","TOT",null,"Tarieven 2019 Loon en Materieel",null,"Nza","Loon","Mat.","Totaal","WN","DB","BH","TOT",null,"Geldig","Excl. bh","Incl. bh","Excl. db","Incl. db",null,"Tijden",null,"Functie",null,"Bezetting",null,"Sector","Prestatie","Codes","Tarief 2019"]
["NR","NAAM","PLAATS","ZOKA","PLAATSZOKA",null,"Cliënt(en) met enkel somatische problematiek",null,"GGZ6B",19.48,3.41,2.2999999999999998,{"$f":"SUM(J2:L2)","v":25.19},null,"GGZ6BJaNee","Z262 ZZP 6ggz-b incl.bh excl.db",{"$f":"LEFT(P2,4)","v":"Z262"},239.41,58.44,{"$f":"SUM(R2:S2)","v":297.85000000000002},19.48,null,2.2999999999999998,{"$f":"SUM(U2:W2)","v":21.78},null,"GGZ6B",null,"x","x","x",null,"07:00:00",null,"Wonen",null,0,null,"GHZ","Wonen","Z001",40.46]
[1,"Zorgcentrum 'De Blanckenbörg'",3010,"Menzis","Zorgkantoor Groningen",null,"Cliënt(en) met enkel gedragsproblematiek",null,"GGZ7B",28.32,5.35,2.2999999999999998,35.97,null,"GGZ6BJaJa","Z263 ZZP 6ggz-b incl.bh incl.db","Z263",258.77999999999997,62.03,320.80999999999995,19.48,3.41,2.2999999999999998,25.19,null,"GGZ7B",null,"x","x","x",null,"07:15:00",null,"Dagbesteding",null,0.2,null,"VVT","Wonen","Z004",44.14]
[3,"Woon-en Zorgcentrum Burgemeester van Julsingha Tehuis",3010,"Menzis","Zorgkantoor Groningen",null,"Cliënt(en) met gedrags- en somatische problematiek",null,"LG5",18.38,5.82,2.31,26.509999999999998,null,"GGZ7BJaNee","Z272 ZZP 7ggz-b incl.bh excl.db","Z272",270.95,60.67,331.62,28.32,null,2.2999999999999998,30.62,null,"LG5","x","x","x","x",null,"07:30:00",null,null,null,0.25,null,"GGZ","Wonen","Z007",48.81]
[4,"Woonzorgcentrum Het Hooge Heem",3010,"Menzis","Zorgkantoor Groningen",null,"Cliënt(en) met gedrags- en of somatische problematiek",null,"LG6",20.57,5.3,2.71,28.580000000000002,null,"GGZ7BJaJa","Z273 ZZP 7ggz-b incl.bh incl.db","Z273",307,67.22,374.22,28.32,5.35,2.2999999999999998,35.97,null,"LG6","x","x","x","x",null,"07:45:00",null,null,null,0.33]
[5,"Stichting De Twentse Zorgcentra",3050,"Menzis","Zorgkantoor Twente",null,null,null,"LG7",23.34,4.4400000000000004,2.4500000000000002,30.23,null,"LG5NeeNee","Z650 ZZP 5lg excl.bh excl.db","Z650",110.35,34.71,145.06,18.38,null,null,18.38,null,"LG7","x","x","x","x",null,"08:00:00",null,null,null,0.4,null,"GHZ","Dagbesteding","Z002",42.14]
[6,"Stichting Vredewold",3010,"Menzis","Zorgkantoor Groningen",null,"Soort aanvraag",null,"LVG4",23.15,2.2999999999999998,4.4800000000000004,29.93,null,"LG5NeeJa","Z651 ZZP 5lg excl.bh incl.db","Z651",152.87,39.479999999999997,192.35,18.38,5.82,null,24.2,null,"LVG4",null,"x",null,"x",null,"08:15:00",null,null,null,0.5,null,"VVT","Dagbesteding","Z005",44.11]
[7,"Stichting Cello",3280,"UVIT","Zorgkantoor Noordoost-Brabant",null,"Enkelvoudige aanvraag (individueel)",null,"LVG5",23.15,2.2999999999999998,4.4800000000000004,29.93,null,"LG5JaNee","Z652 ZZP 5lg incl.bh excl.db","Z652",142.86000000000001,39.409999999999997,182.27,18.38,null,2.31,20.689999999999998,null,"LVG5",null,"x",null,"x",null,"08:30:00",null,null,null,0.6,null,"GGZ","Dagbesteding","Z008",47.09]
[8,"Stichting S&L Zorg",3260,"CZ","Zorgkantoor West-Brabant",null,"Meervoudige aanvraag (groepsmeerzorg)",null,"SGLVG",31.7,4,3.73,39.43,null,"LG5JaJa","Z653 ZZP 5lg incl.bh incl.db","Z653",177.74,50.81,228.55,18.38,5.82,2.31,26.509999999999998,null,"SGLVG",null,"x",null,"x",null,"08:45:00",null,null,null,0.7]
[9,"stichting R.K. Ouderenzorg St. Franciscus",3010,"Menzis","Zorgkantoor Groningen",null,null,null,"VG5",16.71,6.76,1.24,24.709999999999997,null,"LG6Neenee","Z660 ZZP 6lg excl.bh excl.db","Z660",171.94,41.6,213.54,20.57,null,null,20.57,null,"VG5","x","x","x","x",null,"09:00:00",null,null,null,0.75,null,"GHZ","Behandeling","Z003",80.19]
[13,"Stichting Verzorgingscentra Utingeradeel",3020,"De Friesland","Zorgkantoor Friesland",null,"Van toepassing",null,"VG7",21.12,10.91,1.7,33.730000000000004,null,"LG6NeeJa","Z661 ZZP 6lg excl.bh incl.db","Z661",204.67,44.2,248.87,20.57,5.3,null,25.87,null,"VG7","x","x","x","x",null,"09:15:00",null,null,null,0.8,null,"VVT","Behandeling","Z006",94.23]
[14,"Stichting Verzorgingscentrum het Bildt",3020,"De Friesland","Zorgkantoor Friesland",null,"Ja",null,"VG8",21.02,6.76,1.24,29.02,null,"LG6JaNee","Z662 ZZP 6lg incl.bh excl.db","Z662",204.02,47.6,251.62,20.57,null,2.71,23.28,null,"VG8","x","x","x","x",null,"09:30:00",null,null,null,0.9,null,"GGZ","Behandeling","Z009",81.64]
[15,"Stichting Nieuw Unicum",3130,"Achmea","Zorgkantoor Kennemerland",null,"Nee",null,"VV7",19,1.49,2,22.49,null,"LG6JaJa","Z663 ZZP 6lg incl.bh incl.db","Z663",231.01,56.13,287.14,20.57,5.3,2.71,28.580000000000002,null,"VV7","x","x",null,"x",null,"09:45:00",null,null,null,1]
[17,"Woon- en zorgcentrum de Westerkrim",3030,"Achmea","Zorgkantoor Drenthe",null,null,null,"VV8",24.1,0.92,2,27.020000000000003,null,"LG7Neenee","Z670 ZZP 7lg excl.bh excl.db","Z670",190.29,43.32,233.60999999999999,23.34,null,null,23.34,null,"VV8","x","x",null,"x",null,"10:00:00",null,null,null,1.1100000000000001]
[18,"Stichting Derkshoes Zorg en Dienstverlening",3030,"Achmea","Zorgkantoor Drenthe",null,"Dagen",null,"ZG3AUD",32.58,10.59,1.71,44.88,null,"LG7NeeJa","Z671 ZZP 7lg excl.bh incl.db","Z671",222.6,45.54,268.14,23.34,4.4400000000000004,null,27.78,null,"ZG3AUD","x","x","x","x",null,"10:15:00",null,null,null,1.33]
[19,"S' Heeren Loo Zorggroep",3080,"UVIT","Zorgkantoor Nijmegen",null,1,null,"ZG5VIS",23.25,6.75,1.62,31.62,null,"LG7JaNee","Z672 ZZP 7lg incl.bh excl.db","Z672",230.31,51.34,281.64999999999998,23.34,null,2.4500000000000002,25.79,null,"ZG5VIS","x","x","x","x",null,"10:30:00",null,null,null,1.5]
[20,"'s Heeren Zorggroep",3020,"De Friesland","Zorgkantoor Friesland",null,2,null,null,null,null,null,null,null,"LG7JaJa","Z673 ZZP 7lg incl.bh incl.db","Z673",243.78,54.68,298.45999999999998,23.34,4.4400000000000004,2.4500000000000002,30.23,null,null,null,null,null,null,null,"10:45:00",null,null,null,2]
[21,"'s Heeren Loo Zorggroep",3010,"Menzis","Zorgkantoor Groningen",null,3,null,null,null,null,null,null,null,"LVG4JaJa","Z543 ZZP 4lvg incl.bh incl.db","Z543",281.31,56.02,337.33,23.15,2.2999999999999998,4.4800000000000004,29.93,null,null,null,null,null,null,null,"11:00:00",null,null,null,2.5]
[24,"S' Heeren Loo Zorggroep",3070,"Menzis","Zorgkantoor Arnhem",null,4,null,null,null,null,null,null,null,"LVG5JaJa","Z553 ZZP 5lvg incl.bh incl.db","Z553",263.83999999999997,55.78,319.62,23.15,2.2999999999999998,4.4800000000000004,29.93,null,null,null,null,null,null,null,"11:15:00",null,null,null,3]
[26,"S' Heeren Loo Zorggroep",3120,"UVIT","Zorgkantoor Noord-Holland Noord",null,5,null,null,null,null,null,null,null,"SGLVGJaJa","Z573 ZZP 1sglvg incl.bh incl.db","Z573",278.02999999999997,92.68,370.71,31.7,4,3.73,39.43,null,null,null,null,null,null,null,"11:30:00",null,null,null,3.5]
[27,"S' Heeren Loo Zorggroep",3170,"ZorgZekerheid","Zorgkantoor Zuid-Holland Noord",null,6,null,null,null,null,null,null,null,"VG5NeeNee","Z454 ZZP 5vg excl.bh excl.db","Z454",122.45,31.63,154.08000000000001,16.71,null,null,16.71,null,null,null,null,null,null,null,"11:45:00",null,null,null,4]
[28,"Het Westerhonk",3190,"DSW","Zorgkantoor Delft Westland Oostland",null,7,null,null,null,null,null,null,null,"VG5NeeJa","Z455 ZZP 5vg excl.bh incl.db","Z455",160.97,41.57,202.54,16.71,6.76,null,23.47,null,null,null,null,null,null,null,"12:00:00",null,null,null,4.5]
[29,"'s Heeren Loo Zorggroep",3240,"UVIT","Zorgkantoor Waardenland",null,null,null,null,null,null,null,null,null,"VG5JaNee","Z456 ZZP 5vg incl.bh excl.db","Z456",151.55000000000001,39.17,190.72000000000003,16.71,null,1.24,17.95,null,null,null,null,null,null,null,"12:15:00",null,null,null,5]
[31,"S' Heeren Loo Zorggroep",3061,"Salland","Zorgkantoor Midden IJssel",null,"cao",null,null,null,null,null,null,null,"VG5JaJa","Z457 ZZP 5vg incl.bh incl.db","Z457",187.57,48.96,236.53,16.71,6.76,1.24,24.709999999999997,null,null,null,null,null,null,null,"12:30:00",null,null,null,5.5]
[32,"Stichting Woon- en Zorgcentrum Friso",3050,"Menzis","Zorgkantoor Twente",null,"GHZ",2,null,null,null,null,null,null,"VG7NeeNee","Z470 ZZP 7vg excl.bh excl.db","Z470",134.75,32.47,167.22,21.12,null,null,21.12,null,null,null,null,null,null,null,"12:45:00",null,null,null,6]
[33,"Stichting Baalderborg Groep",3040,"Achmea","Zorgkantoor Zwolle",null,"VVT",3,null,null,null,null,null,null,"VG7NeeJa","Z471 ZZP 7vg excl.bh incl.db","Z471",177.81,44.65,222.46,21.12,10.91,null,32.03,null,null,null,null,null,null,null,"13:00:00",null,null,null,6.5]
[34,"Stichting Boogh",3090,"Achmea","Zorgkantoor Utrecht",null,"GGZ",4,null,null,null,null,null,null,"VG7JaNee","Z472 ZZP 7vg incl.bh excl.db","Z472",193.55,45.96,239.51000000000002,21.12,null,1.7,22.82,null,null,null,null,null,null,null,"13:15:00",null,null,null,7]
[35,"Woon- Zorg- en Dienstencentrum 't Dijkhuis",3061,"Salland","Zorgkantoor Midden IJssel",null,null,null,null,null,null,null,null,null,"VG7JaJa","Z473 ZZP 7vg incl.bh incl.db","Z473",246.52,60.12,306.64,21.12,10.91,1.7,33.730000000000004,null,null,null,null,null,null,null,"13:30:00",null,null,null,7.5]
[36,"Stichting Rosengaerde",3040,"Achmea","Zorgkantoor Zwolle",null,null,null,null,null,null,null,null,null,"VG8NeeNee","Z480 ZZP 8vg excl.bh excl.db","Z480",146.34,35,181.34,21.02,null,null,21.02,null,null,null,null,null,null,null,"13:45:00",null,null,null,8]
[37,"Stichting Omega",3150,"Achmea","Zorgkantoor Amsterdam",null,null,null,null,null,null,null,null,null,"VG8NeeJa","Z481 ZZP 8vg excl.bh incl.db","Z481",203.63,45.89,249.51999999999998,21.02,6.76,null,27.78,null,null,null,null,null,null,null,"14:00:00",null,null,null,8.5]
[38,"Stichting Woon- en Zorgcentrum Humanitas",3061,"Salland","Zorgkantoor Midden IJssel",null,null,null,null,null,null,null,null,null,"VG8JaNee","Z482 ZZP 8vg incl.bh excl.db","Z482",181.55,43.3,224.85000000000002,21.02,null,1.24,22.259999999999998,null,null,null,null,null,null,null,"14:15:00",null,null,null,9]
[39,"Herfstzon, Wooncentrum voor Ouderen",3050,"Menzis","Zorgkantoor Twente",null,null,null,null,null,null,null,null,null,"VG8JaJa","Z483 ZZP 8vg incl.bh incl.db","Z483",235.02,56.5,291.52,21.02,6.76,1.24,29.02,null,null,null,null,null,null,null,"14:30:00",null,null,null,9.5]
[40,"Zienn (SMO Fryslan)",3020,"De Friesland","Zorgkantoor Friesland",null,null,null,null,null,null,null,null,null,"VV7NeeJa","Z071 ZZP 7vv excl.bh incl.db","Z071",162.22999999999999,54.08,216.31,19,1.49,null,20.49,null,null,null,null,null,null,null,"14:45:00",null,null,null,10]
[41,"Stichting Radar",3310,"CZ","Zorgkantoor Zuid-Limburg",null,null,null,null,null,null,null,null,null,"VV7JaJa","Z073 ZZP 7vv incl.bh incl.db","Z073",192.31,64.099999999999994,256.40999999999997,19,1.49,2,22.49,null,null,null,null,null,null,null,"15:00:00",null,null,null,11]
[42,"Stichting De Haardstee",3170,"ZorgZekerheid","Zorgkantoor Zuid-Holland Noord",null,null,null,null,null,null,null,null,null,"VV8NeeJa","Z081 ZZP 8vv excl.bh incl.db","Z081",189.31,63.1,252.41,24.1,0.92,null,25.020000000000003,null,null,null,null,null,null,null,"15:15:00",null,null,null,12]
[44,"Prot. Chr. Stichting voor Ouderenzorg Huize Vriezenhof",3050,"Menzis","Zorgkantoor Twente",null,null,null,null,null,null,null,null,null,"VV8JaJa","Z083 ZZP 8vv incl.bh incl.db","Z083",219.41,73.14,292.55,24.1,0.92,2,27.020000000000003,null,null,null,null,null,null,null,"15:30:00",null,null,null,13]
[45,"Stichting De Parabool",3061,"Salland","Zorgkantoor Midden IJssel",null,null,null,null,null,null,null,null,null,"ZG3AUDNeeNee","Z730 ZZP 3zg-auditief excl.bh excl.db","Z730",255.79,61.37,317.15999999999997,32.58,null,null,32.58,null,null,null,null,null,null,null,"15:45:00",null,null,null,14]
[47,"Stichting Verzorgingshuis Talma Apeldoorn",3060,"Achmea","Zorgkantoor Apeldoorn/Zutphen",null,null,null,null,null,null,null,null,null,"ZG3AUDNeeJa","Z731 ZZP 3zg-auditief excl.bh incl.db","Z731",270.57,79.459999999999994,350.03,32.58,10.59,null,43.17,null,null,null,null,null,null,null,"16:00:00",null,null,null,15]
[48,"Stichting Vreedenhoff",3070,"Menzis","Zorgkantoor Arnhem",null,null,null,null,null,null,null,null,null,"ZG3AUDJaNee","Z732 ZZP 3zg-auditief incl.bh excl.db","Z732",289.27999999999997,33.94,323.21999999999997,32.58,null,1.71,34.29,null,null,null,null,null,null,null,"16:15:00",null,null,null,16]
[49,"Hervormde Stichting tot Verzorging van Ouderen",3070,"Menzis","Zorgkantoor Arnhem",null,null,null,null,null,null,null,null,null,"ZG3AUDJaJa","Z733 ZZP 3zg-auditief incl.bh incl.db","Z733",357.52,55.62,413.14,32.58,10.59,1.71,44.88,null,null,null,null,null,null,null,"16:30:00",null,null,null,17]
[53,"Stichting Bethanië",3070,"Menzis","Zorgkantoor Arnhem",null,null,null,null,null,null,null,null,null,"ZG5VISNeeNee","Z850 ZZP 5zg-visueel excl.bh excl.db","Z850",147.68,49.23,196.91,23.25,null,null,23.25,null,null,null,null,null,null,null,"16:45:00",null,null,null,18]
[54,"Stichting Het Maanderzand Gereformeerd Verzorgingshuis",3070,"Menzis","Zorgkantoor Arnhem",null,null,null,null,null,null,null,null,null,"ZG5VISNeeJa","Z851 ZZP 5zg-visueel excl.bh incl.db","Z851",185.43,61.81,247.24,23.25,6.75,null,30,null,null,null,null,null,null,null,"17:00:00",null,null,null,19]
[56,"Stichting Dichterbij",3080,"UVIT","Zorgkantoor Nijmegen",null,null,null,null,null,null,null,null,null,"ZG5VISJaNee","Z852 ZZP 5zg-visueel incl.bh excl.db","Z852",170.64,56.88,227.51999999999998,23.25,null,1.62,24.87,null,null,null,null,null,null,null,"17:15:00",null,null,null,20]
[63,"Malderburch, centrum voor welzijn, wonen en zorg",3080,"UVIT","Zorgkantoor Nijmegen",null,null,null,null,null,null,null,null,null,"ZG5VISJaJa","Z853 ZZP 5zg-visueel incl.bh incl.db","Z853",208.37,69.459999999999994,277.83,23.25,6.75,1.62,31.62,null,null,null,null,null,null,null,"17:30:00"]
[64,"Protestants-Christelijk Zorgcentrum",3280,"UVIT","Zorgkantoor Noordoost-Brabant",null,null,null,null,null,null,null,null,null,null,null,null,null,null,null,null,null,null,null,null,null,null,null,null,null,null,"17:45:00"]
[65,"Stichting Protestants Christelijk Zorgcentrum 't Anker",3080,"UVIT","Zorgkantoor Nijmegen",null,null,null,null,null,null,null,null,null,null,null,null,null,null,null,null,null,null,null,null,null,null,null,null,null,null,"18:00:00"]
[66,"Stichting Woon- en Zorgcentrum Avondlicht",3080,"UVIT","Zorgkantoor Nijmegen",null,null,null,null,null,null,null,null,null,null,null,null,null,null,null,null,null,null,null,null,null,null,null,null,null,null,"18:15:00"]
[67,"Stichting OlmenEs",3020,"De Friesland","Zorgkantoor Friesland",null,null,null,null,null,null,null,null,null,null,null,null,null,null,null,null,null,null,null,null,null,null,null,null,null,null,"18:30:00"]
[68,"Stichting Gasthuis St. Jan de Deo",3080,"UVIT","Zorgkantoor Nijmegen",null,null,null,null,null,null,null,null,null,null,null,null,null,null,null,null,null,null,null,null,null,null,null,null,null,null,"18:45:00"]
[69,"Stichting De Wittenberg",3080,"UVIT","Zorgkantoor Nijmegen",null,null,null,null,null,null,null,null,null,null,null,null,null,null,null,null,null,null,null,null,null,null,null,null,null,null,"19:00:00"]
[71,"Stichting De Ark Gemeenschap Regio Gouda",3200,"UVIT","Zorgkantoor Midden-Holland",null,null,null,null,null,null,null,null,null,null,null,null,null,null,null,null,null,null,null,null,null,null,null,null,null,null,"19:15:00"]
[72,"Stichting Dienstencentrum Oud Burgeren Gasthuis",3080,"UVIT","Zorgkantoor Nijmegen",null,null,null,null,null,null,null,null,null,null,null,null,null,null,null,null,null,null,null,null,null,null,null,null,null,null,"19:30:00"]
[75,"Stichting Maeykehiem",3020,"De Friesland","Zorgkantoor Friesland",null,null,null,null,null,null,null,null,null,null,null,null,null,null,null,null,null,null,null,null,null,null,null,null,null,null,"19:45:00"]
[76,"Stichting Koraal Groep (Noordoost-Brabant)",3280,"UVIT","Zorgkantoor Noordoost-Brabant",null,null,null,null,null,null,null,null,null,null,null,null,null,null,null,null,null,null,null,null,null,null,null,null,null,null,"20:00:00"]
[77,"Stichting Koraal Groep (Midden-Brabant)",3270,"UVIT","Zorgkantoor Midden-Brabant",null,null,null,null,null,null,null,null,null,null,null,null,null,null,null,null,null,null,null,null,null,null,null,null,null,null,"20:15:00"]
[78,"Stichting Koraal Groep (Noord-Limburg)",3300,"UVIT","Zorgkantoor Noord en Midden Limburg",null,null,null,null,null,null,null,null,null,null,null,null,null,null,null,null,null,null,null,null,null,null,null,null,null,null,"20:30:00"]
[79,"Stichting Koraal Groep (Zuid-Limburg)",3310,"CZ","Zorgkantoor Zuid-Limburg",null,null,null,null,null,null,null,null,null,null,null,null,null,null,null,null,null,null,null,null,null,null,null,null,null,null,"20:45:00"]
[80,"Stichting Sterk in Werk",3280,"UVIT","Zorgkantoor Noordoost-Brabant",null,null,null,null,null,null,null,null,null,null,null,null,null,null,null,null,null,null,null,null,null,null,null,null,null,null,"21:00:00"]
[82,"Stichting Daelzicht (Noord-Limburg)",3300,"UVIT","Zorgkantoor Noord en Midden Limburg",null,null,null,null,null,null,null,null,null,null,null,null,null,null,null,null,null,null,null,null,null,null,null,null,null,null,"21:15:00"]
[83,"Stichting Daelzicht (Zuid-Limburg)",3310,"CZ","Zorgkantoor Zuid-Limburg",null,null,null,null,null,null,null,null,null,null,null,null,null,null,null,null,null,null,null,null,null,null,null,null,null,null,"21:30:00"]
[84,"Stichting Zorg-wooncentrum Den Bouw",3060,"Achmea","Zorgkantoor Apeldoorn/Zutphen",null,null,null,null,null,null,null,null,null,null,null,null,null,null,null,null,null,null,null,null,null,null,null,null,null,null,"21:45:00"]
[85,"St. Barbara",3080,"UVIT","Zorgkantoor Nijmegen",null,null,null,null,null,null,null,null,null,null,null,null,null,null,null,null,null,null,null,null,null,null,null,null,null,null,"22:00:00"]
[86,"Stichting Esdégé/Reigersdaal",3120,"UVIT","Zorgkantoor Noord-Holland Noord",null,null,null,null,null,null,null,null,null,null,null,null,null,null,null,null,null,null,null,null,null,null,null,null,null,null,"22:15:00"]
[87,"Stichting Zorgrésidence Regina",3070,"Menzis","Zorgkantoor Arnhem",null,null,null,null,null,null,null,null,null,null,null,null,null,null,null,null,null,null,null,null,null,null,null,null,null,null,"22:30:00"]
[88,"Stichting Verzorgingshuis De Koperhorst",3090,"Achmea","Zorgkantoor Utrecht",null,null,null,null,null,null,null,null,null,null,null,null,null,null,null,null,null,null,null,null,null,null,null,null,null,null,"22:45:00"]
[89,"Stichting Sint Pieters en Bloklands Gasthuis",3090,"Achmea","Zorgkantoor Utrecht",null,null,null,null,null,null,null,null,null,null,null,null,null,null,null,null,null,null,null,null,null,null,null,null,null,null,"23:00:00"]
[91,"Koninklijke Visio (West-Brabant)",3260,"CZ","Zorgkantoor West-Brabant"]
[92,"Koninklijke Visio, LSSB (Groningen)",3010,"Menzis","Zorgkantoor Groningen"]
[99,"Stichting Zorg- en Wooncentrum De Haven",3090,"Achmea","Zorgkantoor Utrecht"]
[100,"Maria Dommer Stichting van 1835",3090,"Achmea","Zorgkantoor Utrecht"]
[101,"Stichting Ouderenzorg Oudewater",3090,"Achmea","Zorgkantoor Utrecht"]
[102,"Stichting Reinaerde",3090,"Achmea","Zorgkantoor Utrecht"]
[103,"Stichting Vecht en IJssel",3090,"Achmea","Zorgkantoor Utrecht"]
[104,"GGNet",3060,"Achmea","Zorgkantoor Apeldoorn/Zutphen"]
[105,"Stichting Bartholomeus Gasthuis",3090,"Achmea","Zorgkantoor Utrecht"]
[106,"Stichting Orion",3210,"Achmea","Zorgkantoor Rotterdam"]
[107,"Stichting Pluryn (Apeldoorn/Zutphen e.o.)",3060,"Achmea","Zorgkantoor Apeldoorn/Zutphen"]
[108,"Stichting Pluryn (Nijmegen)",3080,"UVIT","Zorgkantoor Nijmegen"]
[109,"Stichting Pluryn (Arnhem)",3070,"Menzis","Zorgkantoor Arnhem"]
[111,"Stichting Hervormd Gemeentelijk Zorgcentrum Aelsmeer",3160,"ZorgZekerheid","Zorgkantoor Amstelland en De Meerlanden"]
[114,"Stichting De Zijlen",3010,"Menzis","Zorgkantoor Groningen"]
[115,"Stichting De Passerel",3060,"Achmea","Zorgkantoor Apeldoorn/Zutphen"]
[116,"Zideris (Utrecht)",3090,"Achmea","Zorgkantoor Utrecht"]
[117,"Raphaëlstichting (Noord-Holland Noord)",3120,"UVIT","Zorgkantoor Noord-Holland Noord"]
[120,"Parnassia Groep",3070,"Menzis","Zorgkantoor Arnhem"]
[121,"RIBW Arnhem & Veluwe Vallei",3070,"Menzis","Zorgkantoor Arnhem"]
[123,"Stichting SOVAK",3260,"CZ","Zorgkantoor West-Brabant"]
[124,"Stichting Nieuw Woelwijck",3010,"Menzis","Zorgkantoor Groningen"]
[125,"Stichting Ilmarinen",3010,"Menzis","Zorgkantoor Groningen"]
[126,"Stichting De Lichtenvoorde",3070,"Menzis","Zorgkantoor Arnhem"]
[128,"Stichting Hervormd Centrum Pennemes",3140,"Achmea","Zorgkantoor Zaanstreek/Waterland"]
[129,"Stichting Doopsgezind Zorgcentrum Het Mennistenerf",3140,"Achmea","Zorgkantoor Zaanstreek/Waterland"]
[130,"RIBW Nijmegen en Rivierenland",3080,"UVIT","Zorgkantoor Nijmegen"]
[132,"Protestants Christelijke Stichting voor Wonen en Zorg",3120,"UVIT","Zorgkantoor Noord-Holland Noord"]
[133,"Burgemeester De Boer-Stichting",3240,"UVIT","Zorgkantoor Waardenland"]
[134,"Stichting Leger des Heils Welzijns- en Gezondheidszorg",3240,"UVIT","Zorgkantoor Waardenland"]
[137,"Protestants Interkerkelijke Stichting Zorgcentrum Groot Hoogwaak",3170,"ZorgZekerheid","Zorgkantoor Zuid-Holland Noord"]
[138,"Stichting FRION",3040,"Achmea","Zorgkantoor Zwolle"]
[139,"Jacobs Gasthuis centrum voor verzorgend wonen",3190,"DSW","Zorgkantoor Delft Westland Oostland"]
[140,"Wilhelmina Alida Stichting",3180,"CZ","Zorgkantoor Haaglanden"]
[141,"Stichting Swinhove Groep (vh St.Zorg Woonzorggroep Zwijndrechtse Waard)",3240,"UVIT","Zorgkantoor Waardenland"]
[143,"Stichting Protestants Christelijke Zorgorganisatie De Riederborgh",3230,"CZ","Zorgkantoor Zuid-Hollandse Eilanden"]
[144,"*Stichting ZorgBreed",3210,"Achmea","Zorgkantoor Rotterdam"]
[145,"Stichting R.K. Zorgcentrum Roomburgh",3170,"ZorgZekerheid","Zorgkantoor Zuid-Holland Noord"]
[149,"Stichting Zuidwester (Rotterdam)",3210,"Achmea","Zorgkantoor Rotterdam"]
[150,"Harg Spaland centrum voor zorg en wonen",3190,"DSW","Zorgkantoor Delft Westland Oostland"]
[151,"Stichting Siloah (Twente)",3050,"Menzis","Zorgkantoor Twente"]
[152,"Stichting Siloah (Arnhem)",3070,"Menzis","Zorgkantoor Arnhem"]
[153,"Stichting Siloah (Zeeland)",3250,"CZ","Zorgkantoor Zeeland"]
[154,"Stichting Siloah (Midden-Holland)",3200,"UVIT","Zorgkantoor Midden-Holland"]
[157,"Huis Ter Leede",3240,"UVIT","Zorgkantoor Waardenland"]
[158,"Schiewaegh centrum voor wonen, zorg en welzijn",3190,"DSW","Zorgkantoor Delft Westland Oostland"]
[159,"Vaartland service- en zorgcentrum",3190,"DSW","Zorgkantoor Delft Westland Oostland"]
[160,"Stichting Woongemeenschap voor Ouderen",3230,"CZ","Zorgkantoor Zuid-Hollandse Eilanden"]
[161,"Stichting Woonzorgcentrum De Zeeg",3070,"Menzis","Zorgkantoor Arnhem"]
[162,"Dr. Henri van der Hoevenkliniek",3090,"Achmea","Zorgkantoor Utrecht"]
[163,"Hervormde Stichting Bejaardenzorg Capelle aan den IJssel",3210,"Achmea","Zorgkantoor Rotterdam"]
[164,"Stichting De Rozelaar",3070,"Menzis","Zorgkantoor Arnhem"]
[166,"Stichting Het Spectrum",3240,"UVIT","Zorgkantoor Waardenland"]
[167,"Stichting De Zevenster",3200,"UVIT","Zorgkantoor Midden-Holland"]
[170,"Stichting Amarant",3290,"CZ","Zorgkantoor Zuidoost-Brabant"]
[171,"Stichting Amarant",3280,"UVIT","Zorgkantoor Noordoost-Brabant"]
[176,"Stichting Herman Frantsenhuizen",3190,"DSW","Zorgkantoor Delft Westland Oostland"]
[177,"Stichting Sjaloom Zorg",3230,"CZ","Zorgkantoor Zuid-Hollandse Eilanden"]
[178,"Stichting Arduin",3250,"CZ","Zorgkantoor Zeeland"]
[180,"Stichting Tragel Zorg",3250,"CZ","Zorgkantoor Zeeland"]
[181,"Stichting Ouderenzorg Kapelle",3250,"CZ","Zorgkantoor Zeeland"]
[182,"Juvent jeugd & opvoedhulp Zeeland",3250,"CZ","Zorgkantoor Zeeland"]
[183,"Schutse Zorg Tholen",3250,"CZ","Zorgkantoor Zeeland"]
[184,"Prisma (Midden-Brabant)",3270,"UVIT","Zorgkantoor Midden-Brabant"]
[186,"Stichting Ipse de Bruggen",3170,"ZorgZekerheid","Zorgkantoor Zuid-Holland Noord"]
[187,"Stichting Ipse de Bruggen",3180,"CZ","Zorgkantoor Haaglanden"]
[191,"Stichting Ipse de Bruggen (Zuid-Hollandse Eilanden)",3230,"CZ","Zorgkantoor Zuid-Hollandse Eilanden"]
[193,"Stichting Eilandzorg Schouwen-Duiveland",3250,"CZ","Zorgkantoor Zeeland"]
[195,"Stichting Ruitersbos",3260,"CZ","Zorgkantoor West-Brabant"]
[198,"Stichting De Wijngaerd",3260,"CZ","Zorgkantoor West-Brabant"]
[199,"Stichting Zorgorganisatie Het Hoge Veer",3260,"CZ","Zorgkantoor West-Brabant"]
[200,"Stichting Verzorging Sint Franciscus",3270,"UVIT","Zorgkantoor Midden-Brabant"]
[202,"Stichting Pameijer",3210,"Achmea","Zorgkantoor Rotterdam"]
[205,"Stichting Pameijer",3190,"DSW","Zorgkantoor Delft Westland Oostland"]
[206,"Stichting Pameijer",3210,"Achmea","Zorgkantoor Rotterdam"]
[207,"Stichting Pameijer",3230,"CZ","Zorgkantoor Zuid-Hollandse Eilanden"]
[209,"Stichting De Duynsberg",3270,"UVIT","Zorgkantoor Midden-Brabant"]
[210,"Stichting Het Laar",3270,"UVIT","Zorgkantoor Midden-Brabant"]
[211,"Vanboeijen",3030,"Achmea","Zorgkantoor Drenthe"]
[212,"Stichting Woonzorgcentrum De Annenborch",3280,"UVIT","Zorgkantoor Noordoost-Brabant"]
[213,"Stichting Gemiva-SVG Groep (Zuid-Holland Noord)",3170,"ZorgZekerheid","Zorgkantoor Zuid-Holland Noord"]
[214,"Stichting Gemiva-SVG Groep (Haaglanden)",3180,"CZ","Zorgkantoor Haaglanden"]
[215,"Stichting Gemiva-SVG Groep (Midden-Holland)",3200,"UVIT","Zorgkantoor Midden-Holland"]
[216,"Stichting Gemiva-SVG Groep (Rotterdam)",3210,"Achmea","Zorgkantoor Rotterdam"]
[217,"Stichting Gemiva-SVG Groep (Zuid-Hollandse Eilanden)",3230,"CZ","Zorgkantoor Zuid-Hollandse Eilanden"]
[218,"Stichting Gemiva-SVG Groep (Waardenland)",3240,"UVIT","Zorgkantoor Waardenland"]
[219,"Stichting Gemiva-SVG Groep (Gouda)",3190,"DSW","Zorgkantoor Delft Westland Oostland"]
[220,"Stichting Estinea",3070,"Menzis","Zorgkantoor Arnhem"]
[221,"RIBW Kennemerland, Amstelland en de Meerlanden",3130,"Achmea","Zorgkantoor Kennemerland"]
[222,"Stichting Driestroom",3070,"Menzis","Zorgkantoor Arnhem"]
[223,"Stichting Driestroom",3080,"UVIT","Zorgkantoor Nijmegen"]
[224,"Stichting Odion",3140,"Achmea","Zorgkantoor Zaanstreek/Waterland"]
[226,"Stichting Philadelphia Zorg (Twente)",3050,"Menzis","Zorgkantoor Twente"]
[227,"Stichting Philadelphia Zorg (Apeldoorn/Zutphen e.o.)",3060,"Achmea","Zorgkantoor Apeldoorn/Zutphen"]
[228,"Stichting Philadelphia Zorg (Arnhem)",3070,"Menzis","Zorgkantoor Arnhem"]
[229,"Stichting Philadelphia Zorg (Utrecht)",3090,"Achmea","Zorgkantoor Utrecht"]
[230,"Stichting Philadelphia Zorg (Noord-Holland Noord)",3120,"UVIT","Zorgkantoor Noord-Holland Noord"]
[231,"Stichting Philadelphia Zorg (Zaanstreek / Waterland)",3140,"Achmea","Zorgkantoor Zaanstreek/Waterland"]
[232,"Stichting Philadelphia Zorg (Kennemerland)",3130,"Achmea","Zorgkantoor Kennemerland"]
[233,"Stichting Philadelphia Zorg (Amsterdam)",3150,"Achmea","Zorgkantoor Amsterdam"]
[234,"Stichting Philadelphia Zorg ('t Gooi)",3110,"Achmea","Zorgkantoor 't Gooi"]
[235,"Stichting Philadelphia Zorg (Haaglanden)",3180,"CZ","Zorgkantoor Haaglanden"]
[236,"Stichting Philadelphia Zorg (Zuid-Hollandse Eilanden)",3230,"CZ","Zorgkantoor Zuid-Hollandse Eilanden"]
[237,"Stichting Philadelphia Zorg (Zuid-Holland Noord)",3170,"ZorgZekerheid","Zorgkantoor Zuid-Holland Noord"]
[239,"Stichting Philadelphia Zorg (Midden-Holland)",3200,"UVIT","Zorgkantoor Midden-Holland"]
[241,"Stichting Philadelphia Zorg (Friesland)",3020,"De Friesland","Zorgkantoor Friesland"]
[242,"Stichting Philadelphia Zorg (Zuid-Limburg)",3310,"CZ","Zorgkantoor Zuid-Limburg"]
[243,"Stichting Philadelphia Zorg (Zeeland)",3250,"CZ","Zorgkantoor Zeeland"]
[244,"Stichting Philadelphia Zorg (Noordoost-Brabant)",3280,"UVIT","Zorgkantoor Noordoost-Brabant"]
[245,"Stichting Philadelphia Zorg (Waardenland)",3240,"UVIT","Zorgkantoor Waardenland"]
[246,"Stichting Philadelphia Zorg Groot Rijnmond (Rotterdam)",3210,"Achmea","Zorgkantoor Rotterdam"]
[247,"Stichting Philadelphia Zorg (West-Brabant)",3260,"CZ","Zorgkantoor West-Brabant"]
[248,"Stichting Philadelphia Zorg (Groningen)",3010,"Menzis","Zorgkantoor Groningen"]
[249,"Stichting Philadelphia Zorg (Noord-Limburg)",3300,"UVIT","Zorgkantoor Noord en Midden Limburg"]
[250,"Stichting Philadelphia Zorg (Midden Brabant)",3270,"UVIT","Zorgkantoor Midden-Brabant"]
[251,"Stichting Philadelphia Zorg",3100,"Achmea","Zorgkantoor Flevoland"]
[253,"Stichting Ouderencentrum Huize Beek en Bos",3300,"UVIT","Zorgkantoor Noord en Midden Limburg"]
[255,"R.K. Stichting St. Jozef",3300,"UVIT","Zorgkantoor Noord en Midden Limburg"]
[256,"RIBW HVO-Querido",3150,"Achmea","Zorgkantoor Amsterdam"]
[258,"Stichting Sprank (Groningen)",3010,"Menzis","Zorgkantoor Groningen"]
[259,"Stichting Sprank (Delft Westland Oostland)",3190,"DSW","Zorgkantoor Delft Westland Oostland"]
[260,"Stichting Sprank (Zwolle)",3040,"Achmea","Zorgkantoor Zwolle"]
[261,"RIBW Zaanstreek/Waterland en West-Friesland",3140,"Achmea","Zorgkantoor Zaanstreek/Waterland"]
[265,"Zorgcentrum Talma Haven",3100,"Achmea","Zorgkantoor Flevoland"]
[266,"Stichting Joods Bejaardencentrum 's-Gravenhage",3180,"CZ","Zorgkantoor Haaglanden"]
[267,"Stichting Cavent",3230,"CZ","Zorgkantoor Zuid-Hollandse Eilanden"]
[268,"Stichting De Gelderhorst Centrum voor Oudere Doven",3070,"Menzis","Zorgkantoor Arnhem"]
[270,"Stichting Camphill-Gemeenschap Maartenhuis",3120,"UVIT","Zorgkantoor Noord-Holland Noord"]
[271,"Vegetarisch Zorgcentrum Felixoord",3070,"Menzis","Zorgkantoor Arnhem"]
[272,"Stichting Missiehuis Vrijland",3070,"Menzis","Zorgkantoor Arnhem"]
[273,"Robert Coppesstichting",3280,"UVIT","Zorgkantoor Noordoost-Brabant"]
[274,"Stichting Het Schild, centrum voor visueel gehandicapte ouderen",3070,"Menzis","Zorgkantoor Arnhem"]
[277,"Rosa Spier Stichting",3110,"Achmea","Zorgkantoor 't Gooi"]
[280,"Stichting Woonvoorzieningen LG Noord-Holland Midden",3140,"Achmea","Zorgkantoor Zaanstreek/Waterland"]
[281,"Stichting Sint Anna",3280,"UVIT","Zorgkantoor Noordoost-Brabant"]
[282,"Stichting De Noorderbrug (Friesland)",3020,"De Friesland","Zorgkantoor Friesland"]
[283,"Stichting De Noorderbrug (Drenthe)",3030,"Achmea","Zorgkantoor Drenthe"]
[284,"Stichting De Noorderbrug (Groningen)",3010,"Menzis","Zorgkantoor Groningen"]
[285,"Stichting De Noorderbrug (Midden-IJssel)",3061,"Salland","Zorgkantoor Midden IJssel"]
[286,"Stichting Het Lichtpunt",3170,"ZorgZekerheid","Zorgkantoor Zuid-Holland Noord"]
[287,"Stichting Voorzieningen voor verstandelijk en Meervoudig Gehandicapten Zwolle e.o",3040,"Achmea","Zorgkantoor Zwolle"]
[289,"Stichting De Linde",3120,"UVIT","Zorgkantoor Noord-Holland Noord"]
[290,"Stichting De Keerderberg",3310,"CZ","Zorgkantoor Zuid-Limburg"]
[292,"Stichting De Binnenvest",3170,"ZorgZekerheid","Zorgkantoor Zuid-Holland Noord"]
[293,"Stichting Zorgcentrum La Providence",3300,"UVIT","Zorgkantoor Noord en Midden Limburg"]
[294,"Stichting Thedinghsweert",3080,"UVIT","Zorgkantoor Nijmegen"]
[295,"Stichting Kloosterverzorgingshuis Zusters Onder de Bogen",3310,"CZ","Zorgkantoor Zuid-Limburg"]
[296,"Stichting Woonzorgcentrum De Beyart",3310,"CZ","Zorgkantoor Zuid-Limburg"]
[297,"Stichting Ygdrasil",3061,"Salland","Zorgkantoor Midden IJssel"]
[298,"Landelijke Stichting Vredenoord",3090,"Achmea","Zorgkantoor Utrecht"]
[299,"Stichting tot Exploitatie van Verzorgingsflats Huize Het Oosten",3090,"Achmea","Zorgkantoor Utrecht"]
[300,"Stichting Cosis (NOVO)",3010,"Menzis","Zorgkantoor Groningen"]
[301,"Stichting Zorgcentrum Huize Rosa",3080,"UVIT","Zorgkantoor Nijmegen"]
[303,"Stichting Pedagogisch Sociaal Werk Midden-Limburg",3300,"UVIT","Zorgkantoor Noord en Midden Limburg"]
[304,"Stichting Bejaardenzorg Lazaristen en Dochters der Liefde",3300,"UVIT","Zorgkantoor Noord en Midden Limburg"]
[306,"Stichting Interakt Contour Groep (Twente)",3050,"Menzis","Zorgkantoor Twente"]
[308,"Stichting Interakt Contour Groep (Midden-IJssel)",3061,"Salland","Zorgkantoor Midden IJssel"]
[310,"Stichting Prezzent",3280,"UVIT","Zorgkantoor Noordoost-Brabant"]
[311,"Stichting IJsselmonde-Oost",3230,"CZ","Zorgkantoor Zuid-Hollandse Eilanden"]
[313,"Stichting Anton Constandse (vh RIBW Den Haag)",3180,"CZ","Zorgkantoor Haaglanden"]
[314,"RIBW Fonteynenburg",3180,"CZ","Zorgkantoor Haaglanden"]
[316,"Stichting Careander (Arnhem)",3070,"Menzis","Zorgkantoor Arnhem"]
[317,"Stichting De Akkerwinde",3250,"CZ","Zorgkantoor Zeeland"]
[319,"Stichting Abrona",3090,"Achmea","Zorgkantoor Utrecht"]
[320,"Stichting ASVZ (Rotterdam)",3210,"Achmea","Zorgkantoor Rotterdam"]
[321,"Stichting ASVZ (Waardenland)",3240,"UVIT","Zorgkantoor Waardenland"]
[322,"Stichting ASVZ",3190,"DSW","Zorgkantoor Delft Westland Oostland"]
[323,"Stichting ASVZ (Midden-Holland)",3200,"UVIT","Zorgkantoor Midden-Holland"]
[324,"Stichting ASVZ (West-Brabant)",3260,"CZ","Zorgkantoor West-Brabant"]
[325,"Stichting ASVZ (Zuid-Hollandse Eilanden)",3230,"CZ","Zorgkantoor Zuid-Hollandse Eilanden"]
[326,"Stichting ASVZ",3270,"UVIT","Zorgkantoor Midden-Brabant"]
[327,"Stichting De Trans",3030,"Achmea","Zorgkantoor Drenthe"]
[328,"Stichting Rivierduinen",3170,"ZorgZekerheid","Zorgkantoor Zuid-Holland Noord"]
[329,"Stichting Ouderenzorg Cleijenborch",3250,"CZ","Zorgkantoor Zeeland"]
[331,"JP van den Bent Stichting",3050,"Menzis","Zorgkantoor Twente"]
[332,"JP van den Bent Stichting",3020,"De Friesland","Zorgkantoor Friesland"]
[333,"JP van den Bent Stichting",3080,"UVIT","Zorgkantoor Nijmegen"]
[334,"Stichting Sherpa",3110,"Achmea","Zorgkantoor 't Gooi"]
[337,"Prinsenstichting",3140,"Achmea","Zorgkantoor Zaanstreek/Waterland"]
[338,"Stichting LeekerweideGroep",3120,"UVIT","Zorgkantoor Noord-Holland Noord"]
[339,"Stichting Severinus",3290,"CZ","Zorgkantoor Zuidoost-Brabant"]
[340,"Stichting Gehandicaptenzorg Limburg (Zuid-Limburg)",3310,"CZ","Zorgkantoor Zuid-Limburg"]
[341,"Stichting Gehandicaptenzorg Limburg",3300,"UVIT","Zorgkantoor Noord en Midden Limburg"]
[342,"Stichting SDW",3260,"CZ","Zorgkantoor West-Brabant"]
[343,"Stichting Urtica",3060,"Achmea","Zorgkantoor Apeldoorn/Zutphen"]
[347,"Stichting Humanitas DMH (Groningen)",3010,"Menzis","Zorgkantoor Groningen"]
[351,"Stichting Humanitas DMH (Arnhem)",3070,"Menzis","Zorgkantoor Arnhem"]
[353,"Stichting Humanitas DMH (Midden-IJssel)",3061,"Salland","Zorgkantoor Midden IJssel"]
[355,"Stichting Humanitas DMH (Delft Westland Oostland)",3190,"DSW","Zorgkantoor Delft Westland Oostland"]
[359,"Stichting Antes",3230,"CZ","Zorgkantoor Zuid-Hollandse Eilanden"]
[360,"Stichting Centrum voor Vrijwillige en Professionele Maatschappelijke Dienstverlening",3210,"Achmea","Zorgkantoor Rotterdam"]
[361,"Stichting Zorghotel De Belvertshoeve",3270,"UVIT","Zorgkantoor Midden-Brabant"]
[365,"De Hartekamp Groep",3130,"Achmea","Zorgkantoor Kennemerland"]
[366,"Stichting Het Raamwerk",3170,"ZorgZekerheid","Zorgkantoor Zuid-Holland Noord"]
[367,"Stichting Het Gors",3250,"CZ","Zorgkantoor Zeeland"]
[368,"Siza (Arnhem)",3070,"Menzis","Zorgkantoor Arnhem"]
[369,"Siza (Apeldoorn/Zutphen e.o)",3060,"Achmea","Zorgkantoor Apeldoorn/Zutphen"]
[371,"Karmel Wonen en Dagbesteding BV",3070,"Menzis","Zorgkantoor Arnhem"]
[372,"Stichting Zorgboerderij Chaamdijk",3260,"CZ","Zorgkantoor West-Brabant"]
[373,"BEZINN (Drenthe)",3030,"Achmea","Zorgkantoor Drenthe"]
[374,"Gemini Zorg en Dienstverlening",3270,"UVIT","Zorgkantoor Midden-Brabant"]
[375,"Stichting Middin",3210,"Achmea","Zorgkantoor Rotterdam"]
[378,"Stichting Middin",3230,"CZ","Zorgkantoor Zuid-Hollandse Eilanden"]
[379,"Stichting Middin",3210,"Achmea","Zorgkantoor Rotterdam"]
[382,"Stichting Livio",3050,"Menzis","Zorgkantoor Twente"]
[385,"Stichting Baalderborg",3040,"Achmea","Zorgkantoor Zwolle"]
[386,"Stichting Baalderborg",3050,"Menzis","Zorgkantoor Twente"]
[388,"NOVA Zorgboerderij",3070,"Menzis","Zorgkantoor Arnhem"]
[390,"Zorgverlening PGZ",3300,"UVIT","Zorgkantoor Noord en Midden Limburg"]
[391,"Stichting Oase",3310,"CZ","Zorgkantoor Zuid-Limburg"]
[393,"Stichting Samenwerkende Zorgboeren Zuid (SZZ)",3250,"CZ","Zorgkantoor Zeeland"]
[395,"Doenersdreef Zorg B.V.",3110,"Achmea","Zorgkantoor 't Gooi"]
[396,"Stichting Kind In Ontwikkeling (KIO)",3250,"CZ","Zorgkantoor Zeeland"]
[397,"Stichting Epilepsie Instellingen Nederland (SEIN)",3130,"Achmea","Zorgkantoor Kennemerland"]
[398,"Stichting Kempenhaeghe",3290,"CZ","Zorgkantoor Zuidoost-Brabant"]
[399,"AB-Hulp Twente",3050,"Menzis","Zorgkantoor Twente"]
[401,"Stichting Lentekind",3250,"CZ","Zorgkantoor Zeeland"]
[402,"Stichting Nedereind",3090,"Achmea","Zorgkantoor Utrecht"]
[403,"Stichting Enzo",3140,"Achmea","Zorgkantoor Zaanstreek/Waterland"]
[404,"Stichting Aveleijn",3050,"Menzis","Zorgkantoor Twente"]
[405,"Cardea Jeugdzorg",3170,"ZorgZekerheid","Zorgkantoor Zuid-Holland Noord"]
[406,"Stichting Maatschappelijke Opvang Helmond e.o.",3290,"CZ","Zorgkantoor Zuidoost-Brabant"]
[410,"Stichting De Wederkerigheid",3090,"Achmea","Zorgkantoor Utrecht"]
[415,"Professionals in NAH B.V.",3280,"UVIT","Zorgkantoor Noordoost-Brabant"]
[417,"Professionals in NAH B.V.",3050,"Menzis","Zorgkantoor Twente"]
[418,"Professionals in NAH B.V.",3070,"Menzis","Zorgkantoor Arnhem"]
[420,"Stichting Paswerk Dagbesteding (Werkdag)",3130,"Achmea","Zorgkantoor Kennemerland"]
[422,"Stichting Voor Welzijn, Zorg, Sociaal en Cultureel Werk Beuningen",3080,"UVIT","Zorgkantoor Nijmegen"]
[424,"Zorg- en verblijfsboerderij Juutsom",3250,"CZ","Zorgkantoor Zeeland"]
[428,"Stichting Welzijn Ouderen Arnhem",3070,"Menzis","Zorgkantoor Arnhem"]
[431,"Stichting Welzijn Rijnwaarden",3070,"Menzis","Zorgkantoor Arnhem"]
[434,"Stichting Caleidoz",3070,"Menzis","Zorgkantoor Arnhem"]
[437,"Stichting Maatschappelijke Opvang Midden-Brabant Traverse",3270,"UVIT","Zorgkantoor Midden-Brabant"]
[439,"Stichting Maatschappelijke opvang Verdihuis",3280,"UVIT","Zorgkantoor Noordoost-Brabant"]
[441,"Stichting Sterk Huis",3270,"UVIT","Zorgkantoor Midden-Brabant"]
[443,"Stichting RIMO",3310,"CZ","Zorgkantoor Zuid-Limburg"]
[444,"Stichting Mondriaan",3310,"CZ","Zorgkantoor Zuid-Limburg"]
[445,"RIBW Heuvelland en Maasvallei",3310,"CZ","Zorgkantoor Zuid-Limburg"]
[449,"Talent",3310,"CZ","Zorgkantoor Zuid-Limburg"]
[453,"Labyrint Zorg",3280,"UVIT","Zorgkantoor Noordoost-Brabant"]
[455,"Prozorg B.V.",3020,"De Friesland","Zorgkantoor Friesland"]
[457,"Prodeba B.V.",3170,"ZorgZekerheid","Zorgkantoor Zuid-Holland Noord"]
[459,"Stichting Pension Maaszicht",3210,"Achmea","Zorgkantoor Rotterdam"]
[460,"Stichting Pension Singelzicht",3090,"Achmea","Zorgkantoor Utrecht"]
[463,"Stichting Hof en Hiem",3020,"De Friesland","Zorgkantoor Friesland"]
[465,"Stichting PCSOH",3160,"ZorgZekerheid","Zorgkantoor Amstelland en De Meerlanden"]
[467,"Catharina Stichting",3230,"CZ","Zorgkantoor Zuid-Hollandse Eilanden"]
[468,"Stichting LuciVer",3080,"UVIT","Zorgkantoor Nijmegen"]
[469,"Stichting Vughterstede, zorgcentra voor ouderen",3280,"UVIT","Zorgkantoor Noordoost-Brabant"]
[470,"Stichting Wonen en Zorg Purmerend",3140,"Achmea","Zorgkantoor Zaanstreek/Waterland"]
[472,"Stichting Cato",3180,"CZ","Zorgkantoor Haaglanden"]
[473,"Stichting Zorggroep Ena",3070,"Menzis","Zorgkantoor Arnhem"]
[474,"Exploitatiestichting Westerholm/Rikkers Lubbers",3010,"Menzis","Zorgkantoor Groningen"]
[475,"De Zorgmensen",3060,"Achmea","Zorgkantoor Apeldoorn/Zutphen"]
[476,"Stichting Trimenzo Centrale Diensten",3061,"Salland","Zorgkantoor Midden IJssel"]
[477,"Stichting Sint Joris",3290,"CZ","Zorgkantoor Zuidoost-Brabant"]
[478,"Stichting Zorgcollectief Zuidwest-Drenthe",3030,"Achmea","Zorgkantoor Drenthe"]
[480,"Stichting Eykenburg",3180,"CZ","Zorgkantoor Haaglanden"]
[481,"Zorgplein Maaswaarden",3260,"CZ","Zorgkantoor West-Brabant"]
[482,"Stichting Cedrah",3250,"CZ","Zorgkantoor Zeeland"]
[483,"De Pieter Raat Stichting",3120,"UVIT","Zorgkantoor Noord-Holland Noord"]
[485,"Stichting De Goede Zorg",3060,"Achmea","Zorgkantoor Apeldoorn/Zutphen"]
[486,"Stichting Ouderenzorg Wilgaerden",3120,"UVIT","Zorgkantoor Noord-Holland Noord"]
[487,"Markenheem, centra voor zorg en dienstverlening",3070,"Menzis","Zorgkantoor Arnhem"]
[488,"Christelijke Stichting BCM zorg en dienstverlening",3010,"Menzis","Zorgkantoor Groningen"]
[489,"Woonzorg Flevoland",3100,"Achmea","Zorgkantoor Flevoland"]
[490,"Stichting Alerimus",3230,"CZ","Zorgkantoor Zuid-Hollandse Eilanden"]
[491,"Stichting Samen Zorgen",3070,"Menzis","Zorgkantoor Arnhem"]
[492,"ViVa! Zorggroep Heiloo (Noord-Holland Noord)",3120,"UVIT","Zorgkantoor Noord-Holland Noord"]
[496,"Stichting Surplus",3270,"UVIT","Zorgkantoor Midden-Brabant"]
[501,"Interzorg, Regulier B.V.",3090,"Achmea","Zorgkantoor Utrecht"]
[504,"Parnassus Thuisverpleging",3150,"Achmea","Zorgkantoor Amsterdam"]
[505,"Stichting Sara",3150,"Achmea","Zorgkantoor Amsterdam"]
[507,"Stichting Thuiszorg Zuidwest Friesland",3020,"De Friesland","Zorgkantoor Friesland"]
[508,"Stichting Thuiszorg Het Friese Land",3020,"De Friesland","Zorgkantoor Friesland"]
[512,"Evean Thuiszorg (Noord-Holland Noord)",3120,"UVIT","Zorgkantoor Noord-Holland Noord"]
[514,"Thuiszorg Pantein B.V.",3280,"UVIT","Zorgkantoor Noordoost-Brabant"]
[516,"Stichting Thuiszorg West-Brabant",3260,"CZ","Zorgkantoor West-Brabant"]
[517,"HdS Zorg Christelijke organisatie voor Thuiszorg",3070,"Menzis","Zorgkantoor Arnhem"]
[518,"Stichting Joods Maatschappelijk Werk",3150,"Achmea","Zorgkantoor Amsterdam"]
[523,"IZO Individuele Zorg",3170,"ZorgZekerheid","Zorgkantoor Zuid-Holland Noord"]
[526,"Stichting dr. Schroeder van der Kolk-Bedrijven",3180,"CZ","Zorgkantoor Haaglanden"]
[527,"Stichting Thuiszorg Het Centrum",3090,"Achmea","Zorgkantoor Utrecht"]
[530,"Stichting Ons Bedrijf",3070,"Menzis","Zorgkantoor Arnhem"]
[531,"Stichting Zorg Thuis (Zonneburg)",3090,"Achmea","Zorgkantoor Utrecht"]
[532,"Interzorg Oss Thuiszorg B.V.",3280,"UVIT","Zorgkantoor Noordoost-Brabant"]
[533,"Stichting Combiwel Welzijn",3150,"Achmea","Zorgkantoor Amsterdam"]
[535,"Zienn (Den Eikelaar)",3010,"Menzis","Zorgkantoor Groningen"]
[540,"Stichting Landzijde",3140,"Achmea","Zorgkantoor Zaanstreek/Waterland"]
[544,"Stichting Hospice Dignitas",3120,"UVIT","Zorgkantoor Noord-Holland Noord"]
[552,"Stichting Wonen Plus Welzijn",3120,"UVIT","Zorgkantoor Noord-Holland Noord"]
[553,"NovoCare B.V.",3240,"UVIT","Zorgkantoor Waardenland"]
[555,"Thuiszorg Beers B.V.",3060,"Achmea","Zorgkantoor Apeldoorn/Zutphen"]
[561,"Stichting Zorginjection Thuiszorg",3240,"UVIT","Zorgkantoor Waardenland"]
[564,"Stichting Thuiszorg Helpende Hand",3300,"UVIT","Zorgkantoor Noord en Midden Limburg"]
[569,"Stichting Zozijn",3070,"Menzis","Zorgkantoor Arnhem"]
[571,"Stichting Zozijn",3061,"Salland","Zorgkantoor Midden IJssel"]
[572,"Stichting Zozijn",3080,"UVIT","Zorgkantoor Nijmegen"]
[579,"Stichting De Waerden (Noord-Holland Noord)",3120,"UVIT","Zorgkantoor Noord-Holland Noord"]
[580,"Stichting De Waerden (Kennemerland)",3130,"Achmea","Zorgkantoor Kennemerland"]
[584,"Lijn 5, Amstelduin (Noord-Holland Noord)",3120,"UVIT","Zorgkantoor Noord-Holland Noord"]
[585,"Lijn 5, Amstelduin (Amstelland en de Meerlanden)",3160,"ZorgZekerheid","Zorgkantoor Amstelland en De Meerlanden"]
[590,"Stichting Verpleeghuis Het Parkhuis",3240,"UVIT","Zorgkantoor Waardenland"]
[591,"Verpleeghuis Nebo",3180,"CZ","Zorgkantoor Haaglanden"]
[594,"Stichting Heliomare (Amstelland en de Meerlanden))",3160,"ZorgZekerheid","Zorgkantoor Amstelland en De Meerlanden"]
[595,"Stichting Heliomare (Noord-Holland Noord)",3120,"UVIT","Zorgkantoor Noord-Holland Noord"]
[596,"Stichting Heliomare",3130,"Achmea","Zorgkantoor Kennemerland"]
[597,"Rudolf Steiner Zorg",3180,"CZ","Zorgkantoor Haaglanden"]
[598,"Stichting Pergamijn (Noord-Limburg)",3300,"UVIT","Zorgkantoor Noord en Midden Limburg"]
[599,"Stichting Pergamijn (Zuid-Limburg)",3310,"CZ","Zorgkantoor Zuid-Limburg"]
[601,"Stichting De Okkernoot",3250,"CZ","Zorgkantoor Zeeland"]
[602,"Stichting Reik",3010,"Menzis","Zorgkantoor Groningen"]
[603,"Stichting Talant (Friesland)",3020,"De Friesland","Zorgkantoor Friesland"]
[604,"S.V.V.G. De Schutse",3080,"UVIT","Zorgkantoor Nijmegen"]
[605,"S.V.V.G. De Schutse",3250,"CZ","Zorgkantoor Zeeland"]
[611,"TSN Verzorging & Verpleging B.V.",3050,"Menzis","Zorgkantoor Twente"]
[614,"Thuiszorg Service (Arnhem)",3070,"Menzis","Zorgkantoor Arnhem"]
[616,"Liemerije, deskundige zorg voor ouderen",3070,"Menzis","Zorgkantoor Arnhem"]
[618,"Stichting Profila Zorg (Zuid-Hollandse Eilanden)",3230,"CZ","Zorgkantoor Zuid-Hollandse Eilanden"]
[620,"Stichting Profila Zorg (Groningen)",3010,"Menzis","Zorgkantoor Groningen"]
[623,"Lunet Zorg (Zuidoost-Brabant)",3290,"CZ","Zorgkantoor Zuidoost-Brabant"]
[626,"Stichting Verpleeghuis Salem",3230,"CZ","Zorgkantoor Zuid-Hollandse Eilanden"]
[627,"Humanitas Zorg (Rotterdam)",3210,"Achmea","Zorgkantoor Rotterdam"]
[628,"Humanitas Zorg (Zuid-Hollandse Eilanden)",3230,"CZ","Zorgkantoor Zuid-Hollandse Eilanden"]
[629,"Stichting Reik",3020,"De Friesland","Zorgkantoor Friesland"]
[630,"De Zellingen Nieuwerkerk",3200,"UVIT","Zorgkantoor Midden-Holland"]
[631,"De Zellingen Capelle-Krimpen",3210,"Achmea","Zorgkantoor Rotterdam"]
[636,"Stichting Ecosol Leerbedrijven",3130,"Achmea","Zorgkantoor Kennemerland"]
[637,"Zorg Ondersteuning Nederland Amsterdam",3150,"Achmea","Zorgkantoor Amsterdam"]
[641,"Heilig Hart klooster",3290,"CZ","Zorgkantoor Zuidoost-Brabant"]
[642,"Stichting de Waalboog, zorg welzijn en wonen",3080,"UVIT","Zorgkantoor Nijmegen"]
[643,"Zuyderland Zorgcentra BV (Noord-Limburg)",3300,"UVIT","Zorgkantoor Noord en Midden Limburg"]
[644,"Stichting Zuyderland Medisch Centrum",3310,"CZ","Zorgkantoor Zuid-Limburg"]
[645,"Zuyderland Zorgcentra BV (Zuid-Limburg)",3310,"CZ","Zorgkantoor Zuid-Limburg"]
[646,"Stichting Verpleeghuis Bergweide",3310,"CZ","Zorgkantoor Zuid-Limburg"]
[648,"Stichting MensEnZorg",3020,"De Friesland","Zorgkantoor Friesland"]
[649,"Stichting MensEnZorg",3010,"Menzis","Zorgkantoor Groningen"]
[651,"Stichting Lelie Zorggroep",3240,"UVIT","Zorgkantoor Waardenland"]
[654,"Stichting Lelie Zorggroep",3070,"Menzis","Zorgkantoor Arnhem"]
[659,"CaroCare Thuiszorg B.V",3050,"Menzis","Zorgkantoor Twente"]
[662,"Stichting IrisZorg",3080,"UVIT","Zorgkantoor Nijmegen"]
[666,"WerkPro (Groningen)",3010,"Menzis","Zorgkantoor Groningen"]
[672,"Stichting Thuiszorg Diensten Centrale",3170,"ZorgZekerheid","Zorgkantoor Zuid-Holland Noord"]
[678,"Aafje (Waardenland)",3240,"UVIT","Zorgkantoor Waardenland"]
[679,"Aafje (Zuid-Hollandse Eilanden)",3230,"CZ","Zorgkantoor Zuid-Hollandse Eilanden"]
[680,"Aafje",3210,"Achmea","Zorgkantoor Rotterdam"]
[688,"Stichting ActiVite thuis in wonen, welzijn en zorg",3170,"ZorgZekerheid","Zorgkantoor Zuid-Holland Noord"]
[689,"Buurtzorg Nederland",3050,"Menzis","Zorgkantoor Twente"]
[691,"Buurtzorg Nederland",3080,"UVIT","Zorgkantoor Nijmegen"]
[692,"Buurtzorg Nederland",3260,"CZ","Zorgkantoor West-Brabant"]
[694,"Buurtzorg Nederland",3061,"Salland","Zorgkantoor Midden IJssel"]
[695,"Buurtzorg Nederland",3020,"De Friesland","Zorgkantoor Friesland"]
[696,"Buurtzorg Nederland",3190,"DSW","Zorgkantoor Delft Westland Oostland"]
[697,"Buurtzorg Nederland",3170,"ZorgZekerheid","Zorgkantoor Zuid-Holland Noord"]
[705,"Huize Adegeest",3170,"ZorgZekerheid","Zorgkantoor Zuid-Holland Noord"]
[707,"Stichting Florence",3190,"DSW","Zorgkantoor Delft Westland Oostland"]
[708,"Allerzorg B.V.",3300,"UVIT","Zorgkantoor Noord en Midden Limburg"]
[710,"Allerzorg B.V.",3170,"ZorgZekerheid","Zorgkantoor Zuid-Holland Noord"]
[711,"Allerzorg B.V.",3260,"CZ","Zorgkantoor West-Brabant"]
[712,"Allerzorg B.V.",3020,"De Friesland","Zorgkantoor Friesland"]
[718,"Stichting Carinova",3061,"Salland","Zorgkantoor Midden IJssel"]
[720,"Stichting AmaliaZorg",3290,"CZ","Zorgkantoor Zuidoost-Brabant"]
[722,"AmaliaZorg, locatie Catharinenberg te Oisterwijk",3270,"UVIT","Zorgkantoor Midden-Brabant"]
[726,"Stichting Carintreggeland",3050,"Menzis","Zorgkantoor Twente"]
[729,"Verpleeghuis Den Weeligenberg",3170,"ZorgZekerheid","Zorgkantoor Zuid-Holland Noord"]
[730,"Stichting ZorgBalans",3130,"Achmea","Zorgkantoor Kennemerland"]
[731,"Stichting Christelijk Verpleeghuis Barneveld",3070,"Menzis","Zorgkantoor Arnhem"]
[732,"Thuiszorg Groot Gelre B.V.",3070,"Menzis","Zorgkantoor Arnhem"]
[742,"Stichting Ons Tweede Thuis",3160,"ZorgZekerheid","Zorgkantoor Amstelland en De Meerlanden"]
[743,"Stichting Ons Tweede Thuis",3130,"Achmea","Zorgkantoor Kennemerland"]
[749,"Kentalis Zorg - Effatha Guyot Zorg (Groningen)",3010,"Menzis","Zorgkantoor Groningen"]
[750,"Kentalis Zorg - Viataal (Noordoost-Brabant)",3280,"UVIT","Zorgkantoor Noordoost-Brabant"]
[753,"Stichting Humanitas Onder Dak Twente",3050,"Menzis","Zorgkantoor Twente"]
[755,"GGMD voor Doven en Slechthorenden",3200,"UVIT","Zorgkantoor Midden-Holland"]
[759,"Unal Zorg (Amsterdam)",3150,"Achmea","Zorgkantoor Amsterdam"]
[760,"Stichting Onder Een Dak (Stoed)",3190,"DSW","Zorgkantoor Delft Westland Oostland"]
[761,"Zigzagzorg B.V.",3120,"UVIT","Zorgkantoor Noord-Holland Noord"]
[764,"Trajectum GGZ",3030,"Achmea","Zorgkantoor Drenthe"]
[765,"Maatschappelijke Opvang Breda e.o.",3260,"CZ","Zorgkantoor West-Brabant"]
[767,"PrivaZorg AWBZ B.V.",3020,"De Friesland","Zorgkantoor Friesland"]
[769,"PrivaZorg AWBZ B.V.",3190,"DSW","Zorgkantoor Delft Westland Oostland"]
[773,"PrivaZorg AWBZ B.V.",3240,"UVIT","Zorgkantoor Waardenland"]
[778,"PrivaZorg AWBZ B.V.",3061,"Salland","Zorgkantoor Midden IJssel"]
[780,"RIBW IJssel-Vecht",3040,"Achmea","Zorgkantoor Zwolle"]
[784,"Curadomi (Zuid-Holland Noord)",3170,"ZorgZekerheid","Zorgkantoor Zuid-Holland Noord"]
[787,"Zorgboerderij en Therapeutisch Centrum Wittelte vof/ p.a Mr. R.P. van Boven",3030,"Achmea","Zorgkantoor Drenthe"]
[788,"Zorg- en Therapie Centrtum Wittelte v.o.f. / p.a. Mr. R.P. van Boven, curator",3030,"Achmea","Zorgkantoor Drenthe"]
[793,"Stichting WonenPlus",3310,"CZ","Zorgkantoor Zuid-Limburg"]
[794,"Stichting WonenPlus",3300,"UVIT","Zorgkantoor Noord en Midden Limburg"]
[796,"Zorggroep Sint Maarten - Antonius",3290,"CZ","Zorgkantoor Zuidoost-Brabant"]
[797,"Zorggroep Sint Maarten Friesland",3020,"De Friesland","Zorgkantoor Friesland"]
[799,"Stichting Zorggroep Sint Maarten",3050,"Menzis","Zorgkantoor Twente"]
[805,"Rivas Zorggroep thuiszorg (Waardenland)",3240,"UVIT","Zorgkantoor Waardenland"]
[809,"Rivas Zorggroep thuiszorg (Utrecht)",3090,"Achmea","Zorgkantoor Utrecht"]
[810,"Stichting NOVIzorg",3310,"CZ","Zorgkantoor Zuid-Limburg"]
[825,"Omring",3120,"UVIT","Zorgkantoor Noord-Holland Noord"]
[826,"Zorggroep Solis",3061,"Salland","Zorgkantoor Midden IJssel"]
[830,"Huize Maranatha",3050,"Menzis","Zorgkantoor Twente"]
[831,"Elim",3070,"Menzis","Zorgkantoor Arnhem"]
[837,"Stichting Syndion",3240,"UVIT","Zorgkantoor Waardenland"]
[838,"Stichting Syndion",3080,"UVIT","Zorgkantoor Nijmegen"]
[839,"RST Zorgverleners",3070,"Menzis","Zorgkantoor Arnhem"]
[840,"RST Zorgverleners",3240,"UVIT","Zorgkantoor Waardenland"]
[842,"RST Zorgverleners",3250,"CZ","Zorgkantoor Zeeland"]
[844,"Thuiszorgnet Amstelland en Meerlanden",3160,"ZorgZekerheid","Zorgkantoor Amstelland en De Meerlanden"]
[845,"Buitenhaeghe CW/ZW",3110,"Achmea","Zorgkantoor 't Gooi"]
[847,"PerspeKtief",3190,"DSW","Zorgkantoor Delft Westland Oostland"]
[848,"Woon-Zorgcentrum De Zonnehof",3010,"Menzis","Zorgkantoor Groningen"]
[852,"Stichting Argos Zorggroep regio Noord",3190,"DSW","Zorgkantoor Delft Westland Oostland"]
[853,"Breede Vliet/Meeuwenhof",3210,"Achmea","Zorgkantoor Rotterdam"]
[854,"Hooge-Werf/Klepperweide Es",3230,"CZ","Zorgkantoor Zuid-Hollandse Eilanden"]
[856,"Stichting PartiCura (Haaglanden)",3180,"CZ","Zorgkantoor Haaglanden"]
[862,"Pi - Groep (Friesland)",3020,"De Friesland","Zorgkantoor Friesland"]
[865,"Stichting Zorggarant Thuiszorg Noord-Nederland",3070,"Menzis","Zorgkantoor Arnhem"]
[866,"Stichting Zorggarant Noord-Nederland",3010,"Menzis","Zorgkantoor Groningen"]
[869,"Stichting Land van Horne",3300,"UVIT","Zorgkantoor Noord en Midden Limburg"]
[870,"Stichting Land van Horne",3290,"CZ","Zorgkantoor Zuidoost-Brabant"]
[871,"Stichting Zorgcombinatie Marga Klompé",3070,"Menzis","Zorgkantoor Arnhem"]
[872,"Stichting Zorgcombinatie Marga Klompé (De Hoge Weide)",3060,"Achmea","Zorgkantoor Apeldoorn/Zutphen"]
[873,"*KBO Huize Henricus",3080,"UVIT","Zorgkantoor Nijmegen"]
[875,"Vierstroom (Haaglanden)",3180,"CZ","Zorgkantoor Haaglanden"]
[876,"Vierstroom (Midden-Holland)",3200,"UVIT","Zorgkantoor Midden-Holland"]
[877,"Vierstroom (Delft Westland Oostland)",3190,"DSW","Zorgkantoor Delft Westland Oostland"]
[878,"Zorgcentrum d'Amandelhof",3210,"Achmea","Zorgkantoor Rotterdam"]
[879,"Zorgcentrum Beth-San",3200,"UVIT","Zorgkantoor Midden-Holland"]
[880,"Zorgcentrum Nebo",3240,"UVIT","Zorgkantoor Waardenland"]
[881,"Zorgcentrum Uitzicht",3190,"DSW","Zorgkantoor Delft Westland Oostland"]
[886,"Zorgcentrum Betuweland",3070,"Menzis","Zorgkantoor Arnhem"]
[887,"Huize Sint Jozef",3080,"UVIT","Zorgkantoor Nijmegen"]
[890,"Stichting Laurens",3190,"DSW","Zorgkantoor Delft Westland Oostland"]
[891,"Stichting Laurens",3230,"CZ","Zorgkantoor Zuid-Hollandse Eilanden"]
[894,"Cordaan VG",3150,"Achmea","Zorgkantoor Amsterdam"]
[900,"Cordaan, In het Zomerpark",3160,"ZorgZekerheid","Zorgkantoor Amstelland en De Meerlanden"]
[906,"Directzorg Nederland B.V.",3230,"CZ","Zorgkantoor Zuid-Hollandse Eilanden"]
[907,"Directzorg Nederland B.V.",3210,"Achmea","Zorgkantoor Rotterdam"]
[908,"Directzorg Nederland B.V.",3190,"DSW","Zorgkantoor Delft Westland Oostland"]
[914,"Stichting Zorg Adullam",3070,"Menzis","Zorgkantoor Arnhem"]
[915,"Stichting Zorg Adullam",3240,"UVIT","Zorgkantoor Waardenland"]
[916,"Adullam Zuidwest-Nederland",3230,"CZ","Zorgkantoor Zuid-Hollandse Eilanden"]
[917,"Samenwerkende woon- en zorgvoorzieningen voor gehandicapten (SWZ)",3280,"UVIT","Zorgkantoor Noordoost-Brabant"]
[918,"Samenwerkende woon- en zorgvoorzieningen voor gehandicapten (SWZ)",3290,"CZ","Zorgkantoor Zuidoost-Brabant"]
[919,"Stichting Protestante Zorggroep Crabbehof",3240,"UVIT","Zorgkantoor Waardenland"]
[920,"Frankeland centr.verzorgd wonen,verpleging&welzijn",3190,"DSW","Zorgkantoor Delft Westland Oostland"]
[921,"Atlant Zorggroep",3060,"Achmea","Zorgkantoor Apeldoorn/Zutphen"]
[922,"Stichting Zorggroep Elde",3280,"UVIT","Zorgkantoor Noordoost-Brabant"]
[924,"Stichting Azora",3070,"Menzis","Zorgkantoor Arnhem"]
[925,"Stichting Interzorg Noord Nederland",3030,"Achmea","Zorgkantoor Drenthe"]
[927,"Ananz Wonen-Welzijn-Zorg, onderdeel van de St. Anna Zorggroep",3290,"CZ","Zorgkantoor Zuidoost-Brabant"]
[928,"Stichting De Posten",3050,"Menzis","Zorgkantoor Twente"]
[929,"Stichting Zorgpartners Friesland",3020,"De Friesland","Zorgkantoor Friesland"]
[932,"Stichting Meriant (Alliade)",3020,"De Friesland","Zorgkantoor Friesland"]
[933,"Stichting Sint Jacob",3130,"Achmea","Zorgkantoor Kennemerland"]
[934,"Stichting Valkenhof Centrum voor verpleging en verzorging",3290,"CZ","Zorgkantoor Zuidoost-Brabant"]
[935,"Stichting Sevagram, Zorgcentra",3310,"CZ","Zorgkantoor Zuid-Limburg"]
[936,"Stichting Werkt voor Ouderen",3250,"CZ","Zorgkantoor Zeeland"]
[937,"Stichting Zorgspectrum",3090,"Achmea","Zorgkantoor Utrecht"]
[938,"Van Neynselstichting",3280,"UVIT","Zorgkantoor Noordoost-Brabant"]
[940,"Regionale Stichting Zorgcentra De Kempen",3290,"CZ","Zorgkantoor Zuidoost-Brabant"]
[941,"Stichting Groenhuysen",3260,"CZ","Zorgkantoor West-Brabant"]
[942,"Stichting Woon-Zorgcentra De Rijnhoven",3090,"Achmea","Zorgkantoor Utrecht"]
[944,"Stichting Jan Berchmans",3080,"UVIT","Zorgkantoor Nijmegen"]
[945,"Stichting HilverZorg",3110,"Achmea","Zorgkantoor 't Gooi"]
[946,"Interkerkelijke Stichting Zorgvoorzieningen De Brug",3090,"Achmea","Zorgkantoor Utrecht"]
[947,"Stichting Het Spectrum",3240,"UVIT","Zorgkantoor Waardenland"]
[948,"Stichting de Hoven",3010,"Menzis","Zorgkantoor Groningen"]
[949,"Stichting Kalorama",3080,"UVIT","Zorgkantoor Nijmegen"]
[950,"Zorgspectrum Het Zand",3040,"Achmea","Zorgkantoor Zwolle"]
[952,"Stichting Carinova (Zorggroep De Leiboom)",3061,"Salland","Zorgkantoor Midden IJssel"]
[953,"Stichting Zorggroep Raalte",3061,"Salland","Zorgkantoor Midden IJssel"]
[955,"Stichting Allévo, zorg- en dienstverlening",3250,"CZ","Zorgkantoor Zeeland"]
[959,"Stichting Verpleeg- en Verzorgingshuis De Leystroom",3260,"CZ","Zorgkantoor West-Brabant"]
[960,"Zonnehuisgroep Vlaardingen",3190,"DSW","Zorgkantoor Delft Westland Oostland"]
[961,"Alrijne",3170,"ZorgZekerheid","Zorgkantoor Zuid-Holland Noord"]
[962,"Stichting Raffy, Zorg en Wonen voor Molukse en Indische Ouderen",3260,"CZ","Zorgkantoor West-Brabant"]
[964,"Stichting Sint Elisabeth",3260,"CZ","Zorgkantoor West-Brabant"]
[965,"Stichting Zorggroep Oldael",3180,"CZ","Zorgkantoor Haaglanden"]
[967,"Stichting Mosae Zorggroep",3310,"CZ","Zorgkantoor Zuid-Limburg"]
[969,"Stichting Nusantara",3060,"Achmea","Zorgkantoor Apeldoorn/Zutphen"]
[970,"Innoforte",3070,"Menzis","Zorgkantoor Arnhem"]
[971,"RK Stichting Zorgcentra Meerlanden",3160,"ZorgZekerheid","Zorgkantoor Amstelland en De Meerlanden"]
[972,"Stichting De Zorgboog",3290,"CZ","Zorgkantoor Zuidoost-Brabant"]
[973,"Stichting Woon- en Zorgcentra Haaglanden (WZH)",3180,"CZ","Zorgkantoor Haaglanden"]
[974,"Zuwe Zorg BV",3090,"Achmea","Zorgkantoor Utrecht"]
[975,"Zorgpartners Midden-Holland",3200,"UVIT","Zorgkantoor Midden-Holland"]
[977,"KwadrantGroep/Palet",3020,"De Friesland","Zorgkantoor Friesland"]
[979,"Stichting Zorgcentra De Betuwe",3080,"UVIT","Zorgkantoor Nijmegen"]
[980,"Zorggroep Tangenborgh",3030,"Achmea","Zorgkantoor Drenthe"]
[983,"Stichting Thebe Midden-Brabant",3270,"UVIT","Zorgkantoor Midden-Brabant"]
[984,"Stichting Diafaan p/a Daan Advocatuur & Notariaat",3070,"Menzis","Zorgkantoor Arnhem"]
[985,"Stichting Sint Jozefoord",3280,"UVIT","Zorgkantoor Noordoost-Brabant"]
[986,"Stichting Sutfene",3060,"Achmea","Zorgkantoor Apeldoorn/Zutphen"]
[988,"Stichting Coloriet",3100,"Achmea","Zorgkantoor Flevoland"]
[989,"Stichting Vilente",3070,"Menzis","Zorgkantoor Arnhem"]
[990,"Stichting Avoord, Zorg & Wonen",3260,"CZ","Zorgkantoor West-Brabant"]
[991,"Park Zuiderhout",3260,"CZ","Zorgkantoor West-Brabant"]
[993,"Protestants Interkerkelijke Stichting Zorgverlening Hendrik Ido Ambacht",3240,"UVIT","Zorgkantoor Waardenland"]
[995,"Stichting Zorgcentra Rivierenland",3080,"UVIT","Zorgkantoor Nijmegen"]
[996,"Zorggroep Almere",3110,"Achmea","Zorgkantoor 't Gooi"]
[999,"Stichting Amstelring",3160,"ZorgZekerheid","Zorgkantoor Amstelland en De Meerlanden"]
[1001,"Stichting Zuidzorg (Zuidoost-Brabant)",3290,"CZ","Zorgkantoor Zuidoost-Brabant"]
[1003,"Thuiszorg Rijn en IJssel B.V.",3070,"Menzis","Zorgkantoor Arnhem"]
[1007,"Stichting Hulpvaardig",3120,"UVIT","Zorgkantoor Noord-Holland Noord"]
[1008,"Stichting Zorghulp Westfriesland",3120,"UVIT","Zorgkantoor Noord-Holland Noord"]
[1016,"Stichting Wassenaarse Zorgverlening",3180,"CZ","Zorgkantoor Haaglanden"]
[1017,"Stichting Leger des Heils Welzijns- en Gezondheidszorg",3090,"Achmea","Zorgkantoor Utrecht"]
[1018,"Stichting Woon- en Zorgcentrum De Merwelanden",3240,"UVIT","Zorgkantoor Waardenland"]
[1019,"Stichting Maria-Oord wonen, welzijn, zorg en verpleging",3270,"UVIT","Zorgkantoor Midden-Brabant"]
[1021,"Stichting Zorggroep Meander",3010,"Menzis","Zorgkantoor Groningen"]
[1022,"ZorgSaam Zorgsupport (voorheen Stichting Warmande)",3250,"CZ","Zorgkantoor Zeeland"]
[1023,"RESPECT Zorggroep Scheveningen",3180,"CZ","Zorgkantoor Haaglanden"]
[1024,"De Hervormde Stichting Sonneburgh",3210,"Achmea","Zorgkantoor Rotterdam"]
[1025,"Stichting Zorg en Verpleging Goeree-Overflakkee",3230,"CZ","Zorgkantoor Zuid-Hollandse Eilanden"]
[1026,"Careyn",3090,"Achmea","Zorgkantoor Utrecht"]
[1029,"Stichting Catharina",3070,"Menzis","Zorgkantoor Arnhem"]
[1030,"Stichting Hillegomse Organisaties voor Zorgverlening aan Ouderen (HOZO)",3170,"ZorgZekerheid","Zorgkantoor Zuid-Holland Noord"]
[1031,"Stichting De Riethorst Stromenland",3260,"CZ","Zorgkantoor West-Brabant"]
[1032,"Stichting Zorgverlening Het Baken",3040,"Achmea","Zorgkantoor Zwolle"]
[1043,"Centraalzorg B.V.",3090,"Achmea","Zorgkantoor Utrecht"]
[1045,"Thuiszorg Inis (Rotterdam)",3210,"Achmea","Zorgkantoor Rotterdam"]
[1053,"Stichting Antes",3210,"Achmea","Zorgkantoor Rotterdam"]
[1054,"Nieuwe Eindhovense Opvang Stichting (Neos)",3290,"CZ","Zorgkantoor Zuidoost-Brabant"]
[1056,"Stichting Thebe West-Brabant",3260,"CZ","Zorgkantoor West-Brabant"]
[1057,"Thebe Holding BV (Thuiszorg Midden-Brabant)",3270,"UVIT","Zorgkantoor Midden-Brabant"]
[1064,"Stichting Geriant",3120,"UVIT","Zorgkantoor Noord-Holland Noord"]
[1068,"Stichting Amsta (DKJ)",3150,"Achmea","Zorgkantoor Amsterdam"]
[1069,"Stichting Amsta",3150,"Achmea","Zorgkantoor Amsterdam"]
[1070,"Stichting Residentie Buitenzorg",3010,"Menzis","Zorgkantoor Groningen"]
[1071,"Stichting Residentie Buitenzorg",3030,"Achmea","Zorgkantoor Drenthe"]
[1081,"FlexiCura (Kennemerland)",3130,"Achmea","Zorgkantoor Kennemerland"]
[1083,"Stichting Oosterlengte",3010,"Menzis","Zorgkantoor Groningen"]
[1086,"Stichting RMPI-de Grote Rivieren",3240,"UVIT","Zorgkantoor Waardenland"]
[1093,"RIBW Midden-Brabant",3270,"UVIT","Zorgkantoor Midden-Brabant"]
[1094,"Academisch Centrum KJP Curium",3170,"ZorgZekerheid","Zorgkantoor Zuid-Holland Noord"]
[1097,"UmcGroningen Thuis",3010,"Menzis","Zorgkantoor Groningen"]
[1100,"Thebe Holding BV (Thuiszorg West-Brabant)",3260,"CZ","Zorgkantoor West-Brabant"]
[1101,"Stichting Arkin",3150,"Achmea","Zorgkantoor Amsterdam"]
[1103,"Stichting Pleyade",3070,"Menzis","Zorgkantoor Arnhem"]
[1104,"Stichting ZZG zorggroep",3080,"UVIT","Zorgkantoor Nijmegen"]
[1108,"Stichting Zorggroep Manna",3050,"Menzis","Zorgkantoor Twente"]
[1109,"Vivantes Zorggroep",3310,"CZ","Zorgkantoor Zuid-Limburg"]
[1110,"Stichting AxionContinu",3090,"Achmea","Zorgkantoor Utrecht"]
[1111,"Stichting Vivent",3280,"UVIT","Zorgkantoor Noordoost-Brabant"]
[1114,"Stichting Libertas Leiden",3170,"ZorgZekerheid","Zorgkantoor Zuid-Holland Noord"]
[1115,"Professionals in NAH B.V.",3061,"Salland","Zorgkantoor Midden IJssel"]
[1117,"Maatschappelijk Ondersteunings Bureau B.V.",3210,"Achmea","Zorgkantoor Rotterdam"]
[1118,"Stichting Betere Thuiszorg Twente & Achterhoek",3050,"Menzis","Zorgkantoor Twente"]
[1123,"Stichting Zoë",3150,"Achmea","Zorgkantoor Amsterdam"]
[1127,"Stichting Diaphora Zorgverlening",3070,"Menzis","Zorgkantoor Arnhem"]
[1139,"Stichting Vitras",3090,"Achmea","Zorgkantoor Utrecht"]
[1142,"De ZorgZaak",3030,"Achmea","Zorgkantoor Drenthe"]
[1143,"De ZorgZaak",3010,"Menzis","Zorgkantoor Groningen"]
[1155,"Omega Groep GHZ (Zwolle)",3040,"Achmea","Zorgkantoor Zwolle"]
[1159,"Stichting Schakelring",3270,"UVIT","Zorgkantoor Midden-Brabant"]
[1163,"Stichting Zorgkompas in Beweging",3010,"Menzis","Zorgkantoor Groningen"]
[1166,"Stichting Savant",3290,"CZ","Zorgkantoor Zuidoost-Brabant"]
[1168,"Stichting MeanderGroep Zuid-Limburg",3310,"CZ","Zorgkantoor Zuid-Limburg"]
[1178,"Stichting De Linde",3120,"UVIT","Zorgkantoor Noord-Holland Noord"]
[1179,"Stichting De Linde",3130,"Achmea","Zorgkantoor Kennemerland"]
[1180,"Stichting De Linde",3160,"ZorgZekerheid","Zorgkantoor Amstelland en De Meerlanden"]
[1181,"Attent wonen welzijn zorg",3070,"Menzis","Zorgkantoor Arnhem"]
[1186,"Careyn Zuid-Hollandse Eilanden B.V.",3230,"CZ","Zorgkantoor Zuid-Hollandse Eilanden"]
[1188,"Stichting LIMOR",3020,"De Friesland","Zorgkantoor Friesland"]
[1189,"Stichting LIMOR",3040,"Achmea","Zorgkantoor Zwolle"]
[1190,"Stichting LIMOR",3010,"Menzis","Zorgkantoor Groningen"]
[1191,"Stichting LIMOR",3180,"CZ","Zorgkantoor Haaglanden"]
[1192,"Opella, protestants-christelijke stichting voor wonen, zorg en welzijn",3070,"Menzis","Zorgkantoor Arnhem"]
[1193,"Zorggroep Apeldoorn en omstreken",3060,"Achmea","Zorgkantoor Apeldoorn/Zutphen"]
[1194,"Opella, protestants-christelijke stichting voor wonen, zorg en welzijn",3090,"Achmea","Zorgkantoor Utrecht"]
[1197,"Zorginstellingen Pieter van Foreest",3190,"DSW","Zorgkantoor Delft Westland Oostland"]
[1207,"Stichting Zorggroep Maas&Waal",3080,"UVIT","Zorgkantoor Nijmegen"]
[1210,"Stichting 't Gerack (vh SVONN)",3010,"Menzis","Zorgkantoor Groningen"]
[1211,"Stichting Lentis",3010,"Menzis","Zorgkantoor Groningen"]
[1212,"Dignis",3010,"Menzis","Zorgkantoor Groningen"]
[1213,"Stichting Lentis",3030,"Achmea","Zorgkantoor Drenthe"]
[1214,"Stichting Careaz wonen, welzijn, zorg",3070,"Menzis","Zorgkantoor Arnhem"]
[1218,"Riwis Zorg & Welzijn",3060,"Achmea","Zorgkantoor Apeldoorn/Zutphen"]
[1220,"Stichting Riwis Zorg & Welzijn VVT",3060,"Achmea","Zorgkantoor Apeldoorn/Zutphen"]
[1221,"Zonnehuisgroep IJssel-Vecht",3040,"Achmea","Zorgkantoor Zwolle"]
[1222,"Stichting Amstelring",3150,"Achmea","Zorgkantoor Amsterdam"]
[1223,"Stichting Amstelring",3150,"Achmea","Zorgkantoor Amsterdam"]
[1225,"Stichting ZuidOostZorg",3020,"De Friesland","Zorgkantoor Friesland"]
[1227,"Stichting Volckaert",3260,"CZ","Zorgkantoor West-Brabant"]
[1228,"Stichting Volckaert Dongen",3270,"UVIT","Zorgkantoor Midden-Brabant"]
[1231,"Stichting AV Zorggroep",3240,"UVIT","Zorgkantoor Waardenland"]
[1236,"Zorgstichting t Heem",3270,"UVIT","Zorgkantoor Midden-Brabant"]
[1238,"Stichting JonkersZorg",3120,"UVIT","Zorgkantoor Noord-Holland Noord"]
[1239,"Stichting Exploitatie Hospice Alkmaar",3120,"UVIT","Zorgkantoor Noord-Holland Noord"]
[1240,"Gunst Zorg",3120,"UVIT","Zorgkantoor Noord-Holland Noord"]
[1243,"Stichting Breederzorg Thuiszorg",3280,"UVIT","Zorgkantoor Noordoost-Brabant"]
[1248,"Thuishulp Zorgzaam P/a De advocaten van Van Riet",3090,"Achmea","Zorgkantoor Utrecht"]
[1249,"Zorg op Maat b.v.",3210,"Achmea","Zorgkantoor Rotterdam"]
[1252,"Amaris Zorggroep",3110,"Achmea","Zorgkantoor 't Gooi"]
[1253,"Stichting Inovum",3110,"Achmea","Zorgkantoor 't Gooi"]
[1254,"Protestant Christelijke Stichting Waardeburgh",3240,"UVIT","Zorgkantoor Waardenland"]
[1255,"Cicero Zorggroep",3310,"CZ","Zorgkantoor Zuid-Limburg"]
[1256,"Stichting Alkcare",3120,"UVIT","Zorgkantoor Noord-Holland Noord"]
[1257,"Stichting DSV (Duinrand Salem Vlietstede)",3170,"ZorgZekerheid","Zorgkantoor Zuid-Holland Noord"]
[1258,"Stichting Vitalis WoonZorg Groep (Zuidoost-Brabant)",3290,"CZ","Zorgkantoor Zuidoost-Brabant"]
[1259,"IJsselheem Holding te Kampen",3040,"Achmea","Zorgkantoor Zwolle"]
[1260,"Stichting TriviumMeulenbeltZorg",3050,"Menzis","Zorgkantoor Twente"]
[1261,"Stichting Zorggroep Charim",3090,"Achmea","Zorgkantoor Utrecht"]
[1262,"Stichting Wijdezorg",3170,"ZorgZekerheid","Zorgkantoor Zuid-Holland Noord"]
[1264,"Stichting Vrijwaard",3120,"UVIT","Zorgkantoor Noord-Holland Noord"]
[1265,"Stichting BrabantZorg",3280,"UVIT","Zorgkantoor Noordoost-Brabant"]
[1266,"Vita Amstelland",3160,"ZorgZekerheid","Zorgkantoor Amstelland en De Meerlanden"]
[1268,"De Zorggroep",3300,"UVIT","Zorgkantoor Noord en Midden Limburg"]
[1269,"Stichting Zorggroep Reinalda",3130,"Achmea","Zorgkantoor Kennemerland"]
[1270,"Stichting Zorggroep Liante",3020,"De Friesland","Zorgkantoor Friesland"]
[1272,"Stichting Haagse Wijk- en Woonzorg (HWW)",3180,"CZ","Zorgkantoor Haaglanden"]
[1274,"Aardema Thuiszorg B.V.",3020,"De Friesland","Zorgkantoor Friesland"]
[1277,"Better Life Thuiszorg B.V.",3110,"Achmea","Zorgkantoor 't Gooi"]
[1281,"De Zorgspecialist B.V.",3130,"Achmea","Zorgkantoor Kennemerland"]
[1285,"ROZA zorg",3150,"Achmea","Zorgkantoor Amsterdam"]
[1287,"Zorgfederatie Oldenzaal",3050,"Menzis","Zorgkantoor Twente"]
[1288,"Stichting Zorggroep Amsterdam Oost",3150,"Achmea","Zorgkantoor Amsterdam"]
[1290,"Stichting Insula Dei Huize Kohlmann",3070,"Menzis","Zorgkantoor Arnhem"]
[1291,"Stichting Saffier/Zorggroep De Residentie",3180,"CZ","Zorgkantoor Haaglanden"]
[1292,"Stichting Zorggroep De Vechtstreek",3090,"Achmea","Zorgkantoor Utrecht"]
[1294,"ViVa! Zorggroep (Kennemerland)",3130,"Achmea","Zorgkantoor Kennemerland"]
[1297,"Stichting De Bilthuysen",3090,"Achmea","Zorgkantoor Utrecht"]
[1298,"Stichting Woonzorggroep Samen",3120,"UVIT","Zorgkantoor Noord-Holland Noord"]
[1301,"Stichting HVP Zorg",3180,"CZ","Zorgkantoor Haaglanden"]
[1304,"Thuiszorg Inis (Haaglanden)",3180,"CZ","Zorgkantoor Haaglanden"]
[1305,"ZINN",3010,"Menzis","Zorgkantoor Groningen"]
[1306,"Zorgbruggen Thuiszorg en N-Joying",3290,"CZ","Zorgkantoor Zuidoost-Brabant"]
[1307,"Stichting de Wever",3270,"UVIT","Zorgkantoor Midden-Brabant"]
[1315,"Stichting Sint Annaklooster",3290,"CZ","Zorgkantoor Zuidoost-Brabant"]
[1316,"Stichting Zorgstroom",3250,"CZ","Zorgkantoor Zeeland"]
[1317,"Stichting Zinzia Zorggroep",3070,"Menzis","Zorgkantoor Arnhem"]
[1318,"Zorgorganisatie Zorg-Vuldig b.v. (Zuid-Holland Noord)",3170,"ZorgZekerheid","Zorgkantoor Zuid-Holland Noord"]
[1320,"Advies en Bemiddeling Thuiszorg Zeeland B.V. (ABT)",3250,"CZ","Zorgkantoor Zeeland"]
[1326,"Carepool B.V.",3030,"Achmea","Zorgkantoor Drenthe"]
[1332,"Leven & Zorg p/a mr. P.R.W. Schaink, curator",3150,"Achmea","Zorgkantoor Amsterdam"]
[1335,"Stichting Thuiszorg De Versterking",3150,"Achmea","Zorgkantoor Amsterdam"]
[1338,"Residentiele & Ambulante Zorg RAZ (Twente)",3050,"Menzis","Zorgkantoor Twente"]
[1339,"Brijder Verslavingszorg B.V.",3120,"UVIT","Zorgkantoor Noord-Holland Noord"]
[1340,"Dijk en Duin B.V.",3130,"Achmea","Zorgkantoor Kennemerland"]
[1341,"Bavo Europoort B.V.",3210,"Achmea","Zorgkantoor Rotterdam"]
[1345,"Pro Persona",3070,"Menzis","Zorgkantoor Arnhem"]
[1346,"Pro Persona",3080,"UVIT","Zorgkantoor Nijmegen"]
[1348,"Wijkzorg Comfort B.V.",3010,"Menzis","Zorgkantoor Groningen"]
[1349,"Stichting Zorggroep Raalte",3040,"Achmea","Zorgkantoor Zwolle"]
[1350,"Sinai-Kliniek",3160,"ZorgZekerheid","Zorgkantoor Amstelland en De Meerlanden"]
[1352,"Stichting Warm Thuis",3120,"UVIT","Zorgkantoor Noord-Holland Noord"]
[1353,"Stichting Sensire",3060,"Achmea","Zorgkantoor Apeldoorn/Zutphen"]
[1354,"Stichting Sensire",3070,"Menzis","Zorgkantoor Arnhem"]
[1355,"Stichting Sensire",3061,"Salland","Zorgkantoor Midden IJssel"]
[1357,"Stichting GGZ Noord-Holland-Noord",3120,"UVIT","Zorgkantoor Noord-Holland Noord"]
[1358,"GGZ Oost-Brabant",3280,"UVIT","Zorgkantoor Noordoost-Brabant"]
[1359,"Stichting Mediant GGZ",3050,"Menzis","Zorgkantoor Twente"]
[1360,"GGZ Drenthe (GGZ)",3030,"Achmea","Zorgkantoor Drenthe"]
[1364,"Stichting GGZ Delfland",3190,"DSW","Zorgkantoor Delft Westland Oostland"]
[1365,"Stichting Eleos",3090,"Achmea","Zorgkantoor Utrecht"]
[1366,"Stichting Altrecht",3090,"Achmea","Zorgkantoor Utrecht"]
[1367,"Stichting Altrecht",3090,"Achmea","Zorgkantoor Utrecht"]
[1370,"Stichting GGZ inGeest",3150,"Achmea","Zorgkantoor Amsterdam"]
[1372,"Reinier van Arkel Groep, locatie 's-Hertogenbosch",3280,"UVIT","Zorgkantoor Noordoost-Brabant"]
[1381,"Verslavingszorg Noord Nederland (Groningen)",3010,"Menzis","Zorgkantoor Groningen"]
[1384,"Stichting GGZ West-Brabant",3260,"CZ","Zorgkantoor West-Brabant"]
[1385,"Stichting Adhesie",3061,"Salland","Zorgkantoor Midden IJssel"]
[1386,"Zwolse Poort",3040,"Achmea","Zorgkantoor Zwolle"]
[1387,"Stichting GGZ Friesland",3020,"De Friesland","Zorgkantoor Friesland"]
[1392,"RIBW Leger des Heils GGZ Groningen",3010,"Menzis","Zorgkantoor Groningen"]
[1399,"RIBW Leger des Heils GGZ Amstelland en de Meerlanden",3160,"ZorgZekerheid","Zorgkantoor Amstelland en De Meerlanden"]
[1407,"RIBW Leger des Heils GGZ Twente",3050,"Menzis","Zorgkantoor Twente"]
[1409,"RIBW Leger des Heils GGZ Noord Limburg",3300,"UVIT","Zorgkantoor Noord en Midden Limburg"]
[1410,"RIBW Leger des Heils GGZ Friesland",3020,"De Friesland","Zorgkantoor Friesland"]
[1413,"De Wending Verpleegzorg te Ugchelen",3060,"Achmea","Zorgkantoor Apeldoorn/Zutphen"]
[1414,"Stichting Emergis",3250,"CZ","Zorgkantoor Zeeland"]
[1415,"GGz Breburg",3260,"CZ","Zorgkantoor West-Brabant"]
[1416,"GGZ Breburg",3270,"UVIT","Zorgkantoor Midden-Brabant"]
[1419,"Stichting Cosis (Promens Care)",3030,"Achmea","Zorgkantoor Drenthe"]
[1423,"Kessler Stichting",3180,"CZ","Zorgkantoor Haaglanden"]
[1424,"Stichting CCC Zorg, Midden Brabant",3270,"UVIT","Zorgkantoor Midden-Brabant"]
[1425,"Stichting Middin",3180,"CZ","Zorgkantoor Haaglanden"]
[1427,"Zorgverlening de Friese Wouden",3020,"De Friesland","Zorgkantoor Friesland"]
[1428,"Adelante",3310,"CZ","Zorgkantoor Zuid-Limburg"]
[1429,"Stichting Kloosterverzorgingshuis Glorieux",3290,"CZ","Zorgkantoor Zuidoost-Brabant"]
[1431,"Archipel",3290,"CZ","Zorgkantoor Zuidoost-Brabant"]
[1432,"Zorggroep Groningen",3010,"Menzis","Zorgkantoor Groningen"]
[1433,"Zorg Groep Beek B.V.",3310,"CZ","Zorgkantoor Zuid-Limburg"]
[1434,"Stichting Zorggroep Ter Weel",3250,"CZ","Zorgkantoor Zeeland"]
[1439,"Stichting QuaRijn",3090,"Achmea","Zorgkantoor Utrecht"]
[1442,"Stichting Kwintes",3090,"Achmea","Zorgkantoor Utrecht"]
[1443,"Vitaal Thuiszorg B.V.",3070,"Menzis","Zorgkantoor Arnhem"]
[1445,"De ZorgSter",3180,"CZ","Zorgkantoor Haaglanden"]
[1446,"Directzorg Nederland B.V.",3240,"UVIT","Zorgkantoor Waardenland"]
[1448,"Rivas Zorggroep thuiszorg (West-Brabant)",3260,"CZ","Zorgkantoor West-Brabant"]
[1450,"Prisma (West-Brabant)",3260,"CZ","Zorgkantoor West-Brabant"]
[1451,"Prisma (Noordoost-Brabant)",3280,"UVIT","Zorgkantoor Noordoost-Brabant"]
[1455,"Henriëlla Thuiszorg B.V.",3180,"CZ","Zorgkantoor Haaglanden"]
[1457,"Stichting Argrarische Zorgonderneming Vlist (SAZOV)",3200,"UVIT","Zorgkantoor Midden-Holland"]
[1458,"BetuweZorg B.V.",3080,"UVIT","Zorgkantoor Nijmegen"]
[1466,"Thuiszorg Inis (Nijmegen)",3080,"UVIT","Zorgkantoor Nijmegen"]
[1470,"ZorgPlus (V.O.F)",3070,"Menzis","Zorgkantoor Arnhem"]
[1471,"Thuisgenoten (vh Zorg Plus Twente/Thuis)",3050,"Menzis","Zorgkantoor Twente"]
[1480,"RIBW Leger des Heils GGZ Nijmegen",3080,"UVIT","Zorgkantoor Nijmegen"]
[1485,"Careyn",3210,"Achmea","Zorgkantoor Rotterdam"]
[1488,"NOVUM PlusZorg & Verpleging B.V.",3140,"Achmea","Zorgkantoor Zaanstreek/Waterland"]
[1493,"PrivaZorg AWBZ Zuid Holland Noord",3170,"ZorgZekerheid","Zorgkantoor Zuid-Holland Noord"]
[1504,"Stichting Breederzorg Thuiszorg",3290,"CZ","Zorgkantoor Zuidoost-Brabant"]
[1511,"Stichting Driestroom",3140,"Achmea","Zorgkantoor Zaanstreek/Waterland"]
[1516,"Stichting KAG-zorg",3090,"Achmea","Zorgkantoor Utrecht"]
[1523,"GF Totaalzorg",3070,"Menzis","Zorgkantoor Arnhem"]
[1524,"ABC Zorgcomfort B.V.",3070,"Menzis","Zorgkantoor Arnhem"]
[1532,"Arbe Dienstverlening B.V.",3050,"Menzis","Zorgkantoor Twente"]
[1533,"Comfortzorg AWBZ Heerenveen",3020,"De Friesland","Zorgkantoor Friesland"]
[1534,"Cura Twente",3050,"Menzis","Zorgkantoor Twente"]
[1538,"Pameijer SP (Nieuwe Waterweg Noord)",3190,"DSW","Zorgkantoor Delft Westland Oostland"]
[1545,"Stichting Zorg op Maat (ZOM)",3020,"De Friesland","Zorgkantoor Friesland"]
[1548,"Icare",3010,"Menzis","Zorgkantoor Groningen"]
[1564,"*Stichting LSG-Rentray",3070,"Menzis","Zorgkantoor Arnhem"]
[1579,"LIMOR (Twente)",3050,"Menzis","Zorgkantoor Twente"]
[1580,"LIMOR (Delft Westland Oostland)",3190,"DSW","Zorgkantoor Delft Westland Oostland"]
[1588,"BEZINN (Friesland)",3020,"De Friesland","Zorgkantoor Friesland"]
[1589,"BEZINN",3010,"Menzis","Zorgkantoor Groningen"]
[1592,"Stichting de Droomboom",3110,"Achmea","Zorgkantoor 't Gooi"]
[1593,"Royaal Thuis",3180,"CZ","Zorgkantoor Haaglanden"]
[1594,"Huize Winterdijk",3200,"UVIT","Zorgkantoor Midden-Holland"]
[1596,"Stichting De Heem",3090,"Achmea","Zorgkantoor Utrecht"]
[1600,"Thuisverpleging het Rijk van Nijmegen u.a.",3080,"UVIT","Zorgkantoor Nijmegen"]
[1602,"R95 Routes naar Zorg Groningen B.V.",3010,"Menzis","Zorgkantoor Groningen"]
[1606,"Beter Thuis Wonen Thuiszorg (Groningen)",3010,"Menzis","Zorgkantoor Groningen"]
[1607,"Beter Thuis Wonen Thuiszorg (Midden IJssel)",3061,"Salland","Zorgkantoor Midden IJssel"]
[1608,"Stichting Keroazie",3010,"Menzis","Zorgkantoor Groningen"]
[1618,"Cooperatieve vereniging Boer en Zorg B.A.",3070,"Menzis","Zorgkantoor Arnhem"]
[1622,"Residentiele & Ambulante Zorg RAZ (Friesland)",3020,"De Friesland","Zorgkantoor Friesland"]
[1623,"Residentiele & Ambulante Zorg RAZ (Zuid-Limburg)",3310,"CZ","Zorgkantoor Zuid-Limburg"]
[1624,"Stichting MILO",3310,"CZ","Zorgkantoor Zuid-Limburg"]
[1627,"Stichting ActiVite thuis in wonen, welzijn en zorg",3160,"ZorgZekerheid","Zorgkantoor Amstelland en De Meerlanden"]
[1628,"Buurtzorg regio Groningen",3010,"Menzis","Zorgkantoor Groningen"]
[1629,"Buurtzorg regio Arnhem",3070,"Menzis","Zorgkantoor Arnhem"]
[1633,"Allerzorg B.V.",3010,"Menzis","Zorgkantoor Groningen"]
[1634,"Allerzorg (Twente)",3050,"Menzis","Zorgkantoor Twente"]
[1637,"Zorggroep Kans B.V.",3070,"Menzis","Zorgkantoor Arnhem"]
[1638,"Stichting De Parel",3290,"CZ","Zorgkantoor Zuidoost-Brabant"]
[1648,"Stichting Sjaloom Zorg",3250,"CZ","Zorgkantoor Zeeland"]
[1650,"Interkerkelijke Stichting Zorgvoorzieningen De Brug",3090,"Achmea","Zorgkantoor Utrecht"]
[1652,"Stichting tante Louise-Vivensis Zorg",3260,"CZ","Zorgkantoor West-Brabant"]
[1653,"Stichting Ambiq",3050,"Menzis","Zorgkantoor Twente"]
[1655,"Woonzorgnet BV",3080,"UVIT","Zorgkantoor Nijmegen"]
[1656,"Zorgwaard",3230,"CZ","Zorgkantoor Zuid-Hollandse Eilanden"]
[1657,"Stichting Kentalis Zorg",3180,"CZ","Zorgkantoor Haaglanden"]
[1658,"Stichting Brentano Amstelveen",3160,"ZorgZekerheid","Zorgkantoor Amstelland en De Meerlanden"]
[1659,"Zorggroep Drenthe (Drenthe)",3030,"Achmea","Zorgkantoor Drenthe"]
[1661,"Stichting Fier",3020,"De Friesland","Zorgkantoor Friesland"]
[1662,"GGZ-groep Noord- en Midden Limburg",3300,"UVIT","Zorgkantoor Noord en Midden Limburg"]
[1663,"Icare",3030,"Achmea","Zorgkantoor Drenthe"]
[1664,"Stichting Amerpoort",3090,"Achmea","Zorgkantoor Utrecht"]
[1666,"Stichting Ambiq",3030,"Achmea","Zorgkantoor Drenthe"]
[1669,"Stichting Moveoo",3300,"UVIT","Zorgkantoor Noord en Midden Limburg"]
[1670,"Stichting SIG",3130,"Achmea","Zorgkantoor Kennemerland"]
[1671,"Zorggroep Tellus",3120,"UVIT","Zorgkantoor Noord-Holland Noord"]
[1675,"Icare",3070,"Menzis","Zorgkantoor Arnhem"]
[1676,"Stichting De Witte Hoeve",3280,"UVIT","Zorgkantoor Noordoost-Brabant"]
[1678,"TSN Woonzorg B.V.",3010,"Menzis","Zorgkantoor Groningen"]
[1679,"De Bregthoeve Zorg VOF",3120,"UVIT","Zorgkantoor Noord-Holland Noord"]
[1680,"Evita Zorg B.V. (Haaglanden)",3180,"CZ","Zorgkantoor Haaglanden"]
[1681,"ZorgPlus B.V.",3080,"UVIT","Zorgkantoor Nijmegen"]
[1685,"De Gelukkige Dolfijntjes V.O.F.",3120,"UVIT","Zorgkantoor Noord-Holland Noord"]
[1688,"Stichting MILO",3280,"UVIT","Zorgkantoor Noordoost-Brabant"]
[1690,"Stichting Residentiele & Ambulante Zorg (RAZ)",3280,"UVIT","Zorgkantoor Noordoost-Brabant"]
[1692,"ZieZeZo B.V.",3120,"UVIT","Zorgkantoor Noord-Holland Noord"]
[1693,"Zorgboerderij De Wettering",3080,"UVIT","Zorgkantoor Nijmegen"]
[1697,"Stichting Buitengewoon leren & werken - Prins Heerlijk",3270,"UVIT","Zorgkantoor Midden-Brabant"]
[1700,"Actief Zorg B.V.",3260,"CZ","Zorgkantoor West-Brabant"]
[1701,"Thuiszorg Groot Gelre (Nijmegen)",3080,"UVIT","Zorgkantoor Nijmegen"]
[1703,"Stichting Samenwerkende Zorgboeren Zuid (SZZ)",3280,"UVIT","Zorgkantoor Noordoost-Brabant"]
[1706,"Stichting Multidag Nijmegen (SMN)",3080,"UVIT","Zorgkantoor Nijmegen"]
[1708,"PartiCura (Amstelland en de Meerlanden)",3160,"ZorgZekerheid","Zorgkantoor Amstelland en De Meerlanden"]
[1710,"Stichting Zorgboeren Zuid-Holland",3240,"UVIT","Zorgkantoor Waardenland"]
[1722,"Residentie Buitenzorg (Friesland)",3020,"De Friesland","Zorgkantoor Friesland"]
[1723,"Residentie Buitenzorg (Twente)",3050,"Menzis","Zorgkantoor Twente"]
[1726,"Zorgboerderij De Willemshoeve VOF",3070,"Menzis","Zorgkantoor Arnhem"]
[1727,"Flexiekids (Amstelland en de Meerlanden)",3160,"ZorgZekerheid","Zorgkantoor Amstelland en De Meerlanden"]
[1728,"Flexiekids (Zuid-Holland Noord)",3170,"ZorgZekerheid","Zorgkantoor Zuid-Holland Noord"]
[1731,"De Hemelrijksche Hoeve",3270,"UVIT","Zorgkantoor Midden-Brabant"]
[1733,"Stichting MILO",3070,"Menzis","Zorgkantoor Arnhem"]
[1735,"Adelante",3300,"UVIT","Zorgkantoor Noord en Midden Limburg"]
[1737,"Cooperatieve vereniging Zorg Dichtbij U.A.",3010,"Menzis","Zorgkantoor Groningen"]
[1740,"Allerzorg (Arnhem)",3070,"Menzis","Zorgkantoor Arnhem"]
[1741,"ZorgPlus B.V.",3070,"Menzis","Zorgkantoor Arnhem"]
[1745,"Zorgburo De Liemers B.V.",3070,"Menzis","Zorgkantoor Arnhem"]
[1746,"BrumBrum",3050,"Menzis","Zorgkantoor Twente"]
[1751,"Plushome B.V.",3070,"Menzis","Zorgkantoor Arnhem"]
[1752,"Stichting Wieringa & ten Cate",3070,"Menzis","Zorgkantoor Arnhem"]
[1753,"William Schrikker Stichting Zorg & Wonen",3100,"Achmea","Zorgkantoor Flevoland"]
[1754,"Zorgboerderij de vier jaargetijden",3140,"Achmea","Zorgkantoor Zaanstreek/Waterland"]
[1760,"PIT Twente B.V.",3050,"Menzis","Zorgkantoor Twente"]
[1764,"Traject 58 V.O.F.",3010,"Menzis","Zorgkantoor Groningen"]
[1765,"Zorggroep Stad en Ommeland B.V.",3010,"Menzis","Zorgkantoor Groningen"]
[1769,"PartiCura Midden Holland (Noord-Holland Noord)",3120,"UVIT","Zorgkantoor Noord-Holland Noord"]
[1772,"PrivaZorg Twente",3050,"Menzis","Zorgkantoor Twente"]
[1774,"Joling Thuiszorg BV",3010,"Menzis","Zorgkantoor Groningen"]
[1777,"Cura XL",3010,"Menzis","Zorgkantoor Groningen"]
[1788,"Betsaida Thuiszorg Amsterdam",3150,"Achmea","Zorgkantoor Amsterdam"]
[1789,"Raeger Stichting",3150,"Achmea","Zorgkantoor Amsterdam"]
[1790,"Stichting Zorgboerderij Ons Verlangen",3150,"Achmea","Zorgkantoor Amsterdam"]
[1792,"Stichting De Opbouw",3090,"Achmea","Zorgkantoor Utrecht"]
[1801,"Zorgboerderij ko-bus",3030,"Achmea","Zorgkantoor Drenthe"]
[1803,"Stichting Syndion",3090,"Achmea","Zorgkantoor Utrecht"]
[1810,"Verpleeghuis Norschoten, locatie Putten en Elspeet",3040,"Achmea","Zorgkantoor Zwolle"]
[1832,"Particura (Zuid Holland Noord)",3170,"ZorgZekerheid","Zorgkantoor Zuid-Holland Noord"]
[1833,"Kinderhospice ZonnaCare",3090,"Achmea","Zorgkantoor Utrecht"]
[2003,"De Seizoenen B.V.",3060,"Achmea","Zorgkantoor Apeldoorn/Zutphen"]
[2004,"De Seizoenen B.V.",3310,"CZ","Zorgkantoor Zuid-Limburg"]
[2005,"De Seizoenen B.V.",3290,"CZ","Zorgkantoor Zuidoost-Brabant"]
[2009,"De Seizoenen B.V.",3280,"UVIT","Zorgkantoor Noordoost-Brabant"]
[2012,"De Seizoenen B.V.",3061,"Salland","Zorgkantoor Midden IJssel"]
[2013,"Stichting Zorggroep Noordwest-Veluwe",3040,"Achmea","Zorgkantoor Zwolle"]
[2015,"Stichting Topaz",3170,"ZorgZekerheid","Zorgkantoor Zuid-Holland Noord"]
[2016,"De Zorgcirkel",3140,"Achmea","Zorgkantoor Zaanstreek/Waterland"]
[2020,"Zozijn (Apeldoorn Zutphen e.o.)",3060,"Achmea","Zorgkantoor Apeldoorn/Zutphen"]
[2021,"Perspectief GZ b.v.",3150,"Achmea","Zorgkantoor Amsterdam"]
[2023,"Stichting Viattence",3060,"Achmea","Zorgkantoor Apeldoorn/Zutphen"]
[2025,"Allerzorg (Utrecht)",3090,"Achmea","Zorgkantoor Utrecht"]
[2026,"Stichting Maasduinen",3270,"UVIT","Zorgkantoor Midden-Brabant"]
[2027,"Stichting Careander",3040,"Achmea","Zorgkantoor Zwolle"]
[2028,"Stichting Zonnehuisgroep Noord",3010,"Menzis","Zorgkantoor Groningen"]
[2029,"Lister",3090,"Achmea","Zorgkantoor Utrecht"]
[2030,"Stichting Verian Nijmegen e.o.",3070,"Menzis","Zorgkantoor Arnhem"]
[2031,"Parnassia B.V.",3180,"CZ","Zorgkantoor Haaglanden"]
[2032,"Zorggroep Sint Maarten",3060,"Achmea","Zorgkantoor Apeldoorn/Zutphen"]
[2033,"Stichting Verian",3060,"Achmea","Zorgkantoor Apeldoorn/Zutphen"]
[2034,"Stichting Zorg Adullam",3060,"Achmea","Zorgkantoor Apeldoorn/Zutphen"]
[2036,"TSN Verzorging & Verpleging  B.V.",3090,"Achmea","Zorgkantoor Utrecht"]
[2037,"Accolade Zorggroep",3090,"Achmea","Zorgkantoor Utrecht"]
[2039,"JP van den Bent Stichting",3060,"Achmea","Zorgkantoor Apeldoorn/Zutphen"]
[2040,"Stichting Trajectum",3060,"Achmea","Zorgkantoor Apeldoorn/Zutphen"]
[2041,"Thuiszorg van Oranje",3090,"Achmea","Zorgkantoor Utrecht"]
[2042,"Buurtzorg Nederland",3090,"Achmea","Zorgkantoor Utrecht"]
[2044,"Stichting Pro Senectute",3150,"Achmea","Zorgkantoor Amsterdam"]
[2045,"Zorgfamilie B.V.",3210,"Achmea","Zorgkantoor Rotterdam"]
[2046,"Woonzorg Unie Veluwe",3040,"Achmea","Zorgkantoor Zwolle"]
[2047,"PrivaZorg AWBZ",3090,"Achmea","Zorgkantoor Utrecht"]
[2048,"RST Zorgverleners",3040,"Achmea","Zorgkantoor Zwolle"]
[2049,"Joost Zorgt B.V.",3090,"Achmea","Zorgkantoor Utrecht"]
[2050,"Zigzagzorg B.V.",3150,"Achmea","Zorgkantoor Amsterdam"]
[2051,"Stichting Saxenburgh Groep",3040,"Achmea","Zorgkantoor Zwolle"]
[2054,"Coöperatie Boer en Zorg",3060,"Achmea","Zorgkantoor Apeldoorn/Zutphen"]
[2057,"Professionals in NAH",3060,"Achmea","Zorgkantoor Apeldoorn/Zutphen"]
[2059,"Stichting Lelie Zorggroep",3210,"Achmea","Zorgkantoor Rotterdam"]
[2060,"Residentiële en Ambulante Service en Zorg (RAZ)",3090,"Achmea","Zorgkantoor Utrecht"]
[2061,"Zonnehuisgroep Amstelland",3150,"Achmea","Zorgkantoor Amsterdam"]
[2062,"Beter Thuis Wonen Thuiszorg B.V.",3040,"Achmea","Zorgkantoor Zwolle"]
[2063,"Raphaëlstichting",3140,"Achmea","Zorgkantoor Zaanstreek/Waterland"]
[2064,"Stichting Vitree",3040,"Achmea","Zorgkantoor Zwolle"]
[2065,"Stichting de Tussenvoorziening",3090,"Achmea","Zorgkantoor Utrecht"]
[2066,"Stichting PartiCura",3140,"Achmea","Zorgkantoor Zaanstreek/Waterland"]
[2067,"ExperTcare B.V.",3090,"Achmea","Zorgkantoor Utrecht"]
[2068,"Stichting Vérian Nijmegen e.o.",3080,"UVIT","Zorgkantoor Nijmegen"]
[2069,"Stichting Koninklijke Kentalis",3090,"Achmea","Zorgkantoor Utrecht"]
[2070,"Royal Care",3110,"Achmea","Zorgkantoor 't Gooi"]
[2071,"Koninklijke Visio Expertisecentrum voor Slechtziende en Blinde mensen",3110,"Achmea","Zorgkantoor 't Gooi"]
[2074,"Thuiszorg Groot Gelre B.V.",3210,"Achmea","Zorgkantoor Rotterdam"]
[2075,"Dunya Zorg en Welzijn",3210,"Achmea","Zorgkantoor Rotterdam"]
[2076,"Stichting Profila Zorg",3040,"Achmea","Zorgkantoor Zwolle"]
[2077,"Stichting Leger des Heils Welzijns- en Gezondheidszorg",3070,"Menzis","Zorgkantoor Arnhem"]
[2085,"Heppie Deejs B.V.",3300,"UVIT","Zorgkantoor Noord en Midden Limburg"]
[2087,"William Schrikker Stichting Zorg & Wonen",3120,"UVIT","Zorgkantoor Noord-Holland Noord"]
[2089,"Van Hollant B.V.",3120,"UVIT","Zorgkantoor Noord-Holland Noord"]
[2091,"AristoZorg B.V.",3120,"UVIT","Zorgkantoor Noord-Holland Noord"]
[2112,"Het Zorgmakelaarskantoor ZIN B.V.",3061,"Salland","Zorgkantoor Midden IJssel"]
[2118,"Stichting Ambiq",3020,"De Friesland","Zorgkantoor Friesland"]
[2120,"Stichting de Buitenwereld",3170,"ZorgZekerheid","Zorgkantoor Zuid-Holland Noord"]
[2122,"FlexiCura (Amstelland en De Meerlanden)",3160,"ZorgZekerheid","Zorgkantoor Amstelland en De Meerlanden"]
[2123,"Stichting KinderThuisZorg",3160,"ZorgZekerheid","Zorgkantoor Amstelland en De Meerlanden"]
[2124,"Stichting Landzijde",3160,"ZorgZekerheid","Zorgkantoor Amstelland en De Meerlanden"]
[2126,"Stichting Shiva Zorg",3160,"ZorgZekerheid","Zorgkantoor Amstelland en De Meerlanden"]
[2127,"Vierstroom B.V.",3170,"ZorgZekerheid","Zorgkantoor Zuid-Holland Noord"]
[2128,"ExperTcare B.V.",3160,"ZorgZekerheid","Zorgkantoor Amstelland en De Meerlanden"]
[2129,"ExperTcare B.V.",3170,"ZorgZekerheid","Zorgkantoor Zuid-Holland Noord"]
[2134,"Verslavingszorg Noord Nederland (VNN)",3020,"De Friesland","Zorgkantoor Friesland"]
[2135,"KidzTower",3090,"Achmea","Zorgkantoor Utrecht"]
[2136,"A&S Groep B.V.",3070,"Menzis","Zorgkantoor Arnhem"]
[2137,"Verburgt - Molhuysen Zorg B.V.",3070,"Menzis","Zorgkantoor Arnhem"]
[2139,"Stichting Driestroom",3020,"De Friesland","Zorgkantoor Friesland"]
[2140,"PrivaZorg Arnhem B.V.",3070,"Menzis","Zorgkantoor Arnhem"]
[2141,"Residentiële en Ambulante Service en Zorg (RAZ) B.V.",3160,"ZorgZekerheid","Zorgkantoor Amstelland en De Meerlanden"]
[2143,"Splendid Care B.V.",3110,"Achmea","Zorgkantoor 't Gooi"]
[2144,"Thuiszorg de Lindeboom",3150,"Achmea","Zorgkantoor Amsterdam"]
[2145,"Stichting De Ster Kinderbegeleidingscentrum",3150,"Achmea","Zorgkantoor Amsterdam"]
[2146,"Kediante Zorgservice B.V.",3150,"Achmea","Zorgkantoor Amsterdam"]
[2147,"Zorg op Maat 't Nieuwland B.V.",3050,"Menzis","Zorgkantoor Twente"]
[2149,"Stichting Het Robertshuis",3110,"Achmea","Zorgkantoor 't Gooi"]
[2152,"De ZorgZaak",3040,"Achmea","Zorgkantoor Zwolle"]
[2153,"De Buurtzuster B.V.",3030,"Achmea","Zorgkantoor Drenthe"]
[2154,"Klaver4",3250,"CZ","Zorgkantoor Zeeland"]
[2160,"Zorgcoöperatie Klaver4You",3040,"Achmea","Zorgkantoor Zwolle"]
[2161,"Coöperatie Boer en Zorg",3050,"Menzis","Zorgkantoor Twente"]
[2163,"JP van den Bent Stichting",3070,"Menzis","Zorgkantoor Arnhem"]
[2166,"Stichting Good4Life (Utrecht)",3090,"Achmea","Zorgkantoor Utrecht"]
[2170,"Stichting Reigershoeve",3130,"Achmea","Zorgkantoor Kennemerland"]
[2172,"Madeliefje Thuiszorg",3140,"Achmea","Zorgkantoor Zaanstreek/Waterland"]
[2173,"Thuiszorg Samen Verder B.V.",3290,"CZ","Zorgkantoor Zuidoost-Brabant"]
[2174,"Zorgmed Thuiszorg B.V.",3290,"CZ","Zorgkantoor Zuidoost-Brabant"]
[2177,"Cello",3290,"CZ","Zorgkantoor Zuidoost-Brabant"]
[2179,"Stichting Azibo",3050,"Menzis","Zorgkantoor Twente"]
[2180,"Cura XL",3150,"Achmea","Zorgkantoor Amsterdam"]
[2182,"Stichting Trajectum",3070,"Menzis","Zorgkantoor Arnhem"]
[2183,"Stichting Woonbegeleiding Jong Volwassenen",3050,"Menzis","Zorgkantoor Twente"]
[2184,"William Schrikker Stichting Zorg en Wonen",3010,"Menzis","Zorgkantoor Groningen"]
[2185,"GGNet",3070,"Menzis","Zorgkantoor Arnhem"]
[2187,"JP van den Bent Stichting",3061,"Salland","Zorgkantoor Midden IJssel"]
[2188,"Stichting KinderThuisZorg",3170,"ZorgZekerheid","Zorgkantoor Zuid-Holland Noord"]
[2189,"European Social Projects Office B.V. (ESPO)",3210,"Achmea","Zorgkantoor Rotterdam"]
[2190,"Coöperatie Boer en Zorg",3080,"UVIT","Zorgkantoor Nijmegen"]
[2203,"Stichting Interakt Contour Groep",3040,"Achmea","Zorgkantoor Zwolle"]
[2204,"Stichting De Zorgcirkel",3120,"UVIT","Zorgkantoor Noord-Holland Noord"]
[2205,"Koninklijke Visio Expertisecentrum voor Slechtziende en Blinde mensen",3280,"UVIT","Zorgkantoor Noordoost-Brabant"]
[2209,"Stichting GGZ Centraal",3090,"Achmea","Zorgkantoor Utrecht"]
[2210,"Stichting IrisZorg",3060,"Achmea","Zorgkantoor Apeldoorn/Zutphen"]
[2212,"Icare",3030,"Achmea","Zorgkantoor Drenthe"]
[2213,"Elver",3070,"Menzis","Zorgkantoor Arnhem"]
[2214,"Envida",3310,"CZ","Zorgkantoor Zuid-Limburg"]
[2215,"PrivaZorg AWBZ",3290,"CZ","Zorgkantoor Zuidoost-Brabant"]
[2216,"Stichting Zuidwester",3230,"CZ","Zorgkantoor Zuid-Hollandse Eilanden"]
[2217,"Stichting Geïntegreerde GGZ in Eindhoven en de Kempen",3290,"CZ","Zorgkantoor Zuidoost-Brabant"]
[2218,"Kopland",3010,"Menzis","Zorgkantoor Groningen"]
[2220,"Stichting Boogh",3080,"UVIT","Zorgkantoor Nijmegen"]
[2221,"Klas op Wielen",3120,"UVIT","Zorgkantoor Noord-Holland Noord"]
[2224,"Plushome B.V.",3080,"UVIT","Zorgkantoor Nijmegen"]
[2226,"Stichting Vitras",3070,"Menzis","Zorgkantoor Arnhem"]
[2234,"Stichting Back to Basic Twente",3050,"Menzis","Zorgkantoor Twente"]
[2238,"ExperTcare B.V.",3240,"UVIT","Zorgkantoor Waardenland"]
[2239,"HerZorg B.V.",3070,"Menzis","Zorgkantoor Arnhem"]
[2241,"Thuiszorg Evital B.V. (Nijmegen)",3080,"UVIT","Zorgkantoor Nijmegen"]
[2242,"Stichting Zahet (Nijmegen)",3080,"UVIT","Zorgkantoor Nijmegen"]
[2244,"Stichting Het Robertshuis",3300,"UVIT","Zorgkantoor Noord en Midden Limburg"]
[2246,"Zorgboerderij Berne Wille",3020,"De Friesland","Zorgkantoor Friesland"]
[2251,"Stichting Ludgerus, wonen voor senioren",3061,"Salland","Zorgkantoor Midden IJssel"]
[2252,"FiliCare Zorggroep",3020,"De Friesland","Zorgkantoor Friesland"]
[2255,"Stichting Trajectum",3020,"De Friesland","Zorgkantoor Friesland"]
[2256,"Stichting Estinea",3050,"Menzis","Zorgkantoor Twente"]
[2257,"Beter Thuis Wonen Thuiszorg",3050,"Menzis","Zorgkantoor Twente"]
[2258,"Pallia Zorgbureau B.V.",3190,"DSW","Zorgkantoor Delft Westland Oostland"]
[2259,"Coöperatieve vereniging Zorg Dichtbij U.A.",3050,"Menzis","Zorgkantoor Twente"]
[2260,"Stichting Livio",3070,"Menzis","Zorgkantoor Arnhem"]
[2263,"BV Zorgresidentie Zorg",3280,"UVIT","Zorgkantoor Noordoost-Brabant"]
[2265,"Dagcentra Hof van Twente",3050,"Menzis","Zorgkantoor Twente"]
[2267,"Senioren Zorg Plan B.V.",3160,"ZorgZekerheid","Zorgkantoor Amstelland en De Meerlanden"]
[2268,"Professionals Holding BV",3170,"ZorgZekerheid","Zorgkantoor Zuid-Holland Noord"]
[2270,"Stichting Den Haneker landbouw en zorg",3170,"ZorgZekerheid","Zorgkantoor Zuid-Holland Noord"]
[2272,"Boba GGZ",3170,"ZorgZekerheid","Zorgkantoor Zuid-Holland Noord"]
[2273,"Amare Zorgcoaching B.V.",3270,"UVIT","Zorgkantoor Midden-Brabant"]
[2277,"Zorg Intens B.V.",3020,"De Friesland","Zorgkantoor Friesland"]
[2285,"Wijkzorg Comfort B.V.",3030,"Achmea","Zorgkantoor Drenthe"]
[2286,"Coöperatie Zorg Dichtbij U.A.",3030,"Achmea","Zorgkantoor Drenthe"]
[2290,"Fier Fryslan",3210,"Achmea","Zorgkantoor Rotterdam"]
[2291,"Villa Attent",3050,"Menzis","Zorgkantoor Twente"]
[2292,"Stichting De Passerel",3061,"Salland","Zorgkantoor Midden IJssel"]
[2294,"Thuisgenoten (vh Zorg plus Twente/Thuis)",3070,"Menzis","Zorgkantoor Arnhem"]
[2295,"Thuisgenoten (vh Zorg Plus Twente/Thuis)",3010,"Menzis","Zorgkantoor Groningen"]
[2297,"Stichting Zekere Basis",3050,"Menzis","Zorgkantoor Twente"]
[2300,"Stichting het Maathuis",3050,"Menzis","Zorgkantoor Twente"]
[2301,"Stichting Jan Verhallen",3270,"UVIT","Zorgkantoor Midden-Brabant"]
[2302,"Thuiszorg DAT",3260,"CZ","Zorgkantoor West-Brabant"]
[2304,"Stichting Firmitas",3210,"Achmea","Zorgkantoor Rotterdam"]
[2305,"Abahuis",3210,"Achmea","Zorgkantoor Rotterdam"]
[2306,"Oranjeborg B.V.",3030,"Achmea","Zorgkantoor Drenthe"]
[2307,"De Lichtenvoorde",3060,"Achmea","Zorgkantoor Apeldoorn/Zutphen"]
[2309,"De Gelukkige Dolfijntjes",3140,"Achmea","Zorgkantoor Zaanstreek/Waterland"]
[2313,"Nicon Care BV",3150,"Achmea","Zorgkantoor Amsterdam"]
[2314,"ZieZeZo BV",3140,"Achmea","Zorgkantoor Zaanstreek/Waterland"]
[2316,"Jagerhuis ZIN BV",3090,"Achmea","Zorgkantoor Utrecht"]
[2318,"Plushome B.V.",3090,"Achmea","Zorgkantoor Utrecht"]
[2320,"Ambachtzorg B.V.",3240,"UVIT","Zorgkantoor Waardenland"]
[2322,"Coöperatieve vereniging Zorg Dichtbij u.a.",3070,"Menzis","Zorgkantoor Arnhem"]
[2323,"ZorgPlus B.V.",3050,"Menzis","Zorgkantoor Twente"]
[2325,"Stichting Profila Zorg",3050,"Menzis","Zorgkantoor Twente"]
[2326,"Stichting Trajectum",3050,"Menzis","Zorgkantoor Twente"]
[2328,"Stichting Humanitas DMH",3050,"Menzis","Zorgkantoor Twente"]
[2329,"ContactZorg",3130,"Achmea","Zorgkantoor Kennemerland"]
[2332,"Zonnehuizen Kind & Jeugd",3290,"CZ","Zorgkantoor Zuidoost-Brabant"]
[2336,"Stichting Laurens",3210,"Achmea","Zorgkantoor Rotterdam"]
[2338,"Driezorg, Stichting voor Wonen, Zorg en Welzijn",3040,"Achmea","Zorgkantoor Zwolle"]
[2339,"Stichting Zonnehuisgroep Amstelland",3160,"ZorgZekerheid","Zorgkantoor Amstelland en De Meerlanden"]
[2340,"Stichting met GGZ",3300,"UVIT","Zorgkantoor Noord en Midden Limburg"]
[2342,"Stichting Florence",3180,"CZ","Zorgkantoor Haaglanden"]
[2343,"Zorgcentra Pantein B.V.",3280,"UVIT","Zorgkantoor Noordoost-Brabant"]
[2345,"PC Stichting Woonzorgcentrum Foswert",3020,"De Friesland","Zorgkantoor Friesland"]
[2346,"Stichting Proteion",3300,"UVIT","Zorgkantoor Noord en Midden Limburg"]
[2347,"Stichting Ipse de Bruggen",3190,"DSW","Zorgkantoor Delft Westland Oostland"]
[2348,"Stichting Philadelphia Zorg",3190,"DSW","Zorgkantoor Delft Westland Oostland"]
[2349,"Middin",3190,"DSW","Zorgkantoor Delft Westland Oostland"]
[2350,"Careyn DWO/NWN B.V.",3190,"DSW","Zorgkantoor Delft Westland Oostland"]
[2351,"'s Heeren Loo Zorggroep",3100,"Achmea","Zorgkantoor Flevoland"]
[2352,"Stichting Leger des Heils Welzijns- en Gezondheidszorg",3150,"Achmea","Zorgkantoor Amsterdam"]
[2353,"Stichting Evean Zorg",3140,"Achmea","Zorgkantoor Zaanstreek/Waterland"]
[2354,"'s Heeren Loo Zorggroep",3060,"Achmea","Zorgkantoor Apeldoorn/Zutphen"]
[2355,"S' Heeren Loo Zorggroep",3070,"Menzis","Zorgkantoor Arnhem"]
[2357,"Stichting NiKo",3120,"UVIT","Zorgkantoor Noord-Holland Noord"]
[2361,"DM Exploitatie B.V. (Amsterdam)",3150,"Achmea","Zorgkantoor Amsterdam"]
[2362,"Stichting Carinova Thuiszorg Salland",3040,"Achmea","Zorgkantoor Zwolle"]
[2363,"Stichting ZorgWiel (Arnhem)",3070,"Menzis","Zorgkantoor Arnhem"]
[2364,"Stichting Breder",3070,"Menzis","Zorgkantoor Arnhem"]
[2365,"Zorgcoöperatie Accent U.A.",3090,"Achmea","Zorgkantoor Utrecht"]
[2366,"Stichting het Robertshuis",3310,"CZ","Zorgkantoor Zuid-Limburg"]
[2367,"Multi Plus Zorg B.V.",3150,"Achmea","Zorgkantoor Amsterdam"]
[2368,"Idesta B.V.",3020,"De Friesland","Zorgkantoor Friesland"]
[2370,"WoonZorg Combinatie Overijssel B.V.",3040,"Achmea","Zorgkantoor Zwolle"]
[2371,"Stichting Lelie Zorggroep",3260,"CZ","Zorgkantoor West-Brabant"]
[2372,"Stichting I.C.Z. Cura- Hoofdkantoor",3210,"Achmea","Zorgkantoor Rotterdam"]
[2373,"Stichting Ela (Zwolle)",3040,"Achmea","Zorgkantoor Zwolle"]
[2374,"AvantiZorg",3080,"UVIT","Zorgkantoor Nijmegen"]
[2376,"Nocht en Wille Zorg B.V.",3020,"De Friesland","Zorgkantoor Friesland"]
[2377,"City Kids Rotterdam B.V.",3210,"Achmea","Zorgkantoor Rotterdam"]
[2379,"Stichting Zorggroep Scilla Andante",3030,"Achmea","Zorgkantoor Drenthe"]
[2380,"Thuiszorg Dichtbij",3020,"De Friesland","Zorgkantoor Friesland"]
[2382,"Stichting Uniek Begeiding",3050,"Menzis","Zorgkantoor Twente"]
[2388,"Jagerhuis ZIN B.V.",3070,"Menzis","Zorgkantoor Arnhem"]
[2390,"DM Exploitatie B.V. (Nijmegen)",3080,"UVIT","Zorgkantoor Nijmegen"]
[2393,"Stichting De Berkelhof",3070,"Menzis","Zorgkantoor Arnhem"]
[2394,"Zideris (Arnhem)",3070,"Menzis","Zorgkantoor Arnhem"]
[2396,"Residentiële en Ambulante Service en Zorg (RAZ) B.V.",3061,"Salland","Zorgkantoor Midden IJssel"]
[2397,"NewCare4you thuiszorg B.V.",3210,"Achmea","Zorgkantoor Rotterdam"]
[2399,"STMG B.V.",3070,"Menzis","Zorgkantoor Arnhem"]
[2400,"Stichting Thuiszorg en Maatschappelijk werk Rivierenland",3070,"Menzis","Zorgkantoor Arnhem"]
[2401,"Stichting Philadelphia Zorg",3061,"Salland","Zorgkantoor Midden IJssel"]
[2402,"Kennemerzorg B.V.",3130,"Achmea","Zorgkantoor Kennemerland"]
[2403,"Wijkverpleging Carpe Diem U.A.",3150,"Achmea","Zorgkantoor Amsterdam"]
[2404,"Stichting Leger des Heils Welzijns- en Gezondheidszorg",3030,"Achmea","Zorgkantoor Drenthe"]
[2405,"ORO Helmond",3290,"CZ","Zorgkantoor Zuidoost-Brabant"]
[2406,"Stichting Leger des Heils Welzijns- en Gezondheidszorg",3180,"CZ","Zorgkantoor Haaglanden"]
[2407,"Stichting Intermetzo Zorg",3060,"Achmea","Zorgkantoor Apeldoorn/Zutphen"]
[2408,"Waterlandswelzijn BV",3140,"Achmea","Zorgkantoor Zaanstreek/Waterland"]
[2410,"Fleurage Residence Bloemendaal B.V.",3130,"Achmea","Zorgkantoor Kennemerland"]
[2411,"Beweging 3.0",3090,"Achmea","Zorgkantoor Utrecht"]
[2413,"Hanzeheerd",3040,"Achmea","Zorgkantoor Zwolle"]
[2414,"Stichting Lievegoed",3090,"Achmea","Zorgkantoor Utrecht"]
[2415,"Stichting Bartimeus Sonneheerdt",3090,"Achmea","Zorgkantoor Utrecht"]
[2418,"Aanzien B.V.",3090,"Achmea","Zorgkantoor Utrecht"]
[2419,"Woonzorg de Berkenhof B.V.",3030,"Achmea","Zorgkantoor Drenthe"]
[2420,"Vlindervrije Zorg B.V.",3140,"Achmea","Zorgkantoor Zaanstreek/Waterland"]
[2421,"Roos Begeleiding B.V.",3100,"Achmea","Zorgkantoor Flevoland"]
[2422,"Zorggroep Oude en Nieuwe Land",3100,"Achmea","Zorgkantoor Flevoland"]
[2423,"Het Westerhonk",3180,"CZ","Zorgkantoor Haaglanden"]
[2424,"Ambulante Hulpverlening Midden Nederland B.V.",3040,"Achmea","Zorgkantoor Zwolle"]
[2425,"Jeugdprofs",3210,"Achmea","Zorgkantoor Rotterdam"]
[2427,"Leyhoeve Zorg B.V.",3270,"UVIT","Zorgkantoor Midden-Brabant"]
[2429,"Coöperatie Limburgse Zorgboeren U.A.",3300,"UVIT","Zorgkantoor Noord en Midden Limburg"]
[2431,"Stichting Zuidzorg (Noord en Midden Limburg)",3300,"UVIT","Zorgkantoor Noord en Midden Limburg"]
[2432,"Stichting Trifolium Zorg/Advocatenkantoor Van Weelderen B.V.",3061,"Salland","Zorgkantoor Midden IJssel"]
[2433,"Stichting Zorggroep Apeldoorn en omstreken",3061,"Salland","Zorgkantoor Midden IJssel"]
[2434,"Stichting Milo: Wegbereiders in communicatie",3020,"De Friesland","Zorgkantoor Friesland"]
[2435,"BijZonder ZorgenKind B.V.",3061,"Salland","Zorgkantoor Midden IJssel"]
[2436,"Stichting Good4Life (Midden IJssel)",3061,"Salland","Zorgkantoor Midden IJssel"]
[2437,"Polder Residence",3120,"UVIT","Zorgkantoor Noord-Holland Noord"]
[2438,"PrivaZorg AWBZ B.V.",3160,"ZorgZekerheid","Zorgkantoor Amstelland en De Meerlanden"]
[2439,"Zorggroep 't Zicht",3280,"UVIT","Zorgkantoor Noordoost-Brabant"]
[2440,"Dagopvang de Nostalgie BV",3090,"Achmea","Zorgkantoor Utrecht"]
[2441,"De Kroon Zorginstelling B.V. (Nijmegen)",3080,"UVIT","Zorgkantoor Nijmegen"]
[2442,"Thuiszorg Hart voor Nederland B.V.",3090,"Achmea","Zorgkantoor Utrecht"]
[2443,"Stichting Buro Lima",3280,"UVIT","Zorgkantoor Noordoost-Brabant"]
[2444,"Kinderhospice Binnenveld",3070,"Menzis","Zorgkantoor Arnhem"]
[2445,"Stichting ZorgWiel (Noordoost-Brabant)",3280,"UVIT","Zorgkantoor Noordoost-Brabant"]
[2446,"Stichting ZAHET (Arnhem)",3070,"Menzis","Zorgkantoor Arnhem"]
[2447,"Stichting Zeker Zorg",3050,"Menzis","Zorgkantoor Twente"]
[2448,"Dagopvang De Nostalgie B.V.",3160,"ZorgZekerheid","Zorgkantoor Amstelland en De Meerlanden"]
[2449,"Zorgbureau De Stellingwerven B.V.",3020,"De Friesland","Zorgkantoor Friesland"]
[2453,"A.D.O. Thuiszorg B.V.",3210,"Achmea","Zorgkantoor Rotterdam"]
[2455,"Stichting KwadrantGroep",3020,"De Friesland","Zorgkantoor Friesland"]
[2457,"Onvergetelijk Leven B.V.",3090,"Achmea","Zorgkantoor Utrecht"]
[2458,"Maison-Thuiszorg B.V.",3140,"Achmea","Zorgkantoor Zaanstreek/Waterland"]
[2460,"Dagelijks Leven (Zuidoost-Brabant)",3290,"CZ","Zorgkantoor Zuidoost-Brabant"]
[2464,"MT Thuiszorg B.V.",3040,"Achmea","Zorgkantoor Zwolle"]
[2465,"Carefree",3050,"Menzis","Zorgkantoor Twente"]
[2466,"AltraCura B.V.",3310,"CZ","Zorgkantoor Zuid-Limburg"]
[2467,"DM Exploitatie B.V. (Midden IJssel)",3061,"Salland","Zorgkantoor Midden IJssel"]
[2468,"Zorgzaam Nederland",3180,"CZ","Zorgkantoor Haaglanden"]
[2474,"Stichting Art Loca",3100,"Achmea","Zorgkantoor Flevoland"]
[2475,"Mijn Thuiszorg B.V.",3030,"Achmea","Zorgkantoor Drenthe"]
[2480,"De Zorgkeien B.V.",3030,"Achmea","Zorgkantoor Drenthe"]
[2481,"Zorgorganisatie 24-7 Zorg om de Hoek B.V.",3180,"CZ","Zorgkantoor Haaglanden"]
[2482,"Noord Nederlandse Cooperatie van Zorginstellingen",3030,"Achmea","Zorgkantoor Drenthe"]
[2483,"Warande",3090,"Achmea","Zorgkantoor Utrecht"]
[2486,"Omega Groep B.V.",3040,"Achmea","Zorgkantoor Zwolle"]
[2487,"Patyna",3020,"De Friesland","Zorgkantoor Friesland"]
[2488,"Stichting Vivium Zorggroep",3110,"Achmea","Zorgkantoor 't Gooi"]
[2489,"RijnWaal Zorggroep",3070,"Menzis","Zorgkantoor Arnhem"]
[2490,"Stichting Cardia - Duinrust",3180,"CZ","Zorgkantoor Haaglanden"]
[2491,"Cordaan",3150,"Achmea","Zorgkantoor Amsterdam"]
[2492,"Stichting Vleugelzorg",3310,"CZ","Zorgkantoor Zuid-Limburg"]
[2493,"Stichting ZorgAccent",3050,"Menzis","Zorgkantoor Twente"]
[2494,"Stichting Humanitas DMH",3090,"Achmea","Zorgkantoor Utrecht"]
[2495,"Stichting Treant Care",3030,"Achmea","Zorgkantoor Drenthe"]
[2496,"ViVa Zorggroep Noord-Holland Noord",3120,"UVIT","Zorgkantoor Noord-Holland Noord"]
[2497,"Elis Thuiszorg B.V.",3310,"CZ","Zorgkantoor Zuid-Limburg"]
[2499,"Stichting Amarant Groep",3270,"UVIT","Zorgkantoor Midden-Brabant"]
[2500,"Stichting Nusantara Zorg",3290,"CZ","Zorgkantoor Zuidoost-Brabant"]
[2501,"Coöperatie Limburgse Zorgboeren U.A.",3310,"CZ","Zorgkantoor Zuid-Limburg"]
[2504,"Kinderhotels Mappa Mundo B.V.",3180,"CZ","Zorgkantoor Haaglanden"]
[2505,"Stichting Amarant Groep",3260,"CZ","Zorgkantoor West-Brabant"]
[2506,"Stichting MaasstadZorg",3210,"Achmea","Zorgkantoor Rotterdam"]
[2507,"Stichting Lievegoed",3260,"CZ","Zorgkantoor West-Brabant"]
[2508,"MartiniZorg B.V.",3010,"Menzis","Zorgkantoor Groningen"]
[2509,"Stichting Titurel",3260,"CZ","Zorgkantoor West-Brabant"]
[2510,"Crataegus Zorg B.V.",3260,"CZ","Zorgkantoor West-Brabant"]
[2512,"Stichting Fier",3310,"CZ","Zorgkantoor Zuid-Limburg"]
[2513,"ZorgPlus B.V.",3060,"Achmea","Zorgkantoor Apeldoorn/Zutphen"]
[2514,"Zorggroep BOAT B.V.",3030,"Achmea","Zorgkantoor Drenthe"]
[2515,"L Zorg B.V.",3110,"Achmea","Zorgkantoor 't Gooi"]
[2517,"Home Instead Thuisservice Rotterdam boven de Maas e.o.",3210,"Achmea","Zorgkantoor Rotterdam"]
[2518,"Stichting Driestroom",3260,"CZ","Zorgkantoor West-Brabant"]
[2519,"Meesterwerk B.V.",3040,"Achmea","Zorgkantoor Zwolle"]
[2521,"Home Instead Thuisservice Kennemerland B.V.",3130,"Achmea","Zorgkantoor Kennemerland"]
[2522,"Stichting Switch Care",3150,"Achmea","Zorgkantoor Amsterdam"]
[2524,"De Oude Pastorie",3110,"Achmea","Zorgkantoor 't Gooi"]
[2525,"Joost Zorgt Nederland B.V.",3260,"CZ","Zorgkantoor West-Brabant"]
[2526,"KiZo Kinderthuiszorg/ExperTcare B.V.",3180,"CZ","Zorgkantoor Haaglanden"]
[2527,"Zorggroep Vitez B.V.",3030,"Achmea","Zorgkantoor Drenthe"]
[2528,"Stichting Zorggroep Noorderboog",3030,"Achmea","Zorgkantoor Drenthe"]
[2529,"Stichting Joyce-House Nederland",3030,"Achmea","Zorgkantoor Drenthe"]
[2532,"Stichting Driestroom",3310,"CZ","Zorgkantoor Zuid-Limburg"]
[2533,"Zorgbureau De Stellingwerven B.V.",3040,"Achmea","Zorgkantoor Zwolle"]
[2534,"Ambulante Thuiszorg Wijkverpleging B.V.",3310,"CZ","Zorgkantoor Zuid-Limburg"]
[2535,"Distel Zorg B.V. p/a mr. L.V. van Gardingen, Curator",3150,"Achmea","Zorgkantoor Amsterdam"]
[2536,"Stichting Excellent Leven",3110,"Achmea","Zorgkantoor 't Gooi"]
[2537,"IZT-Limburg B.V.",3310,"CZ","Zorgkantoor Zuid-Limburg"]
[2538,"Stichting Ben Oude NijHuis",3210,"Achmea","Zorgkantoor Rotterdam"]
[2539,"PrivaZorg AWBZ B.V. (Zuid-Limburg)",3310,"CZ","Zorgkantoor Zuid-Limburg"]
[2540,"Zorg-Los B.V.",3090,"Achmea","Zorgkantoor Utrecht"]
[2541,"*Stichting Vitalis WoonZorg Groep (Zuid-Limburg)",3310,"CZ","Zorgkantoor Zuid-Limburg"]
[2542,"Stichting Driestroom",3210,"Achmea","Zorgkantoor Rotterdam"]
[2543,"Stichting Driestroom",3170,"ZorgZekerheid","Zorgkantoor Zuid-Holland Noord"]
[2544,"Stichting Driestroom",3010,"Menzis","Zorgkantoor Groningen"]
[2545,"Stichting Driestroom",3050,"Menzis","Zorgkantoor Twente"]
[2546,"Thuiszorg Gezellig B.V.",3040,"Achmea","Zorgkantoor Zwolle"]
[2547,"Home Instead Thuisservice Amsterdam Centrum ZW B.V.",3150,"Achmea","Zorgkantoor Amsterdam"]
[2548,"Home Instead Thuisservice Deventer Lochem Zutphen",3060,"Achmea","Zorgkantoor Apeldoorn/Zutphen"]
[2549,"Stichting Care 2 Get There",3210,"Achmea","Zorgkantoor Rotterdam"]
[2550,"Coöperatie Ondernemers i/d Kleinschalige Zorg U.A.",3250,"CZ","Zorgkantoor Zeeland"]
[2551,"Stichting Good4Life (Haaglanden)",3180,"CZ","Zorgkantoor Haaglanden"]
[2552,"Stichting Villa Boerebont",3260,"CZ","Zorgkantoor West-Brabant"]
[2553,"Maatschap MCE Zorg",3070,"Menzis","Zorgkantoor Arnhem"]
[2554,"De Kroon Zorginstelling B.V. (Arnhem)",3070,"Menzis","Zorgkantoor Arnhem"]
[2555,"Stichting Thuisteam Twente",3050,"Menzis","Zorgkantoor Twente"]
[2556,"Coöperatie Hesterhuizen U.A. (Amstelland)",3160,"ZorgZekerheid","Zorgkantoor Amstelland en De Meerlanden"]
[2557,"Zorgoptimaal (vh Coöperatie Amstelland-Meerlanden)",3160,"ZorgZekerheid","Zorgkantoor Amstelland en De Meerlanden"]
[2558,"Coöperatie ZorgProfessionals Twente U.A.",3050,"Menzis","Zorgkantoor Twente"]
[2559,"Olcea Nieuwe Zorglandschap B.V.",3050,"Menzis","Zorgkantoor Twente"]
[2560,"PGVZ B.V.",3040,"Achmea","Zorgkantoor Zwolle"]
[2561,"Stepping Stones Home & Care Zorg B.V. (Apeldoorn Zutphen)",3060,"Achmea","Zorgkantoor Apeldoorn/Zutphen"]
[2562,"Stepping Stones Home & Care Zorg B.V. (Arnhem)",3070,"Menzis","Zorgkantoor Arnhem"]
[2563,"MOB Drechtsteden B.V.",3240,"UVIT","Zorgkantoor Waardenland"]
[2564,"Zorgcoöperatie Thuisbasis Brabant U.A. (Midden Brabant)",3270,"UVIT","Zorgkantoor Midden-Brabant"]
[2565,"Freeway Zorg B.V.",3110,"Achmea","Zorgkantoor 't Gooi"]
[2566,"Stichting Jah Jireh Woonzorg Wageningen",3070,"Menzis","Zorgkantoor Arnhem"]
[2567,"Sa-Net Wonen B.V.",3070,"Menzis","Zorgkantoor Arnhem"]
[2568,"SMT Zorg & Zorgadvies",3050,"Menzis","Zorgkantoor Twente"]
[2569,"ZaZ Welzijn",3050,"Menzis","Zorgkantoor Twente"]
[2570,"Zorggroep Achterhoek B.V. (Arnhem)",3070,"Menzis","Zorgkantoor Arnhem"]
[2571,"Sanare Thuiszorg B.V.",3200,"UVIT","Zorgkantoor Midden-Holland"]
[2572,"Active4you B.V. (Zuidoost Brabant)",3290,"CZ","Zorgkantoor Zuidoost-Brabant"]
[2573,"Pro Faktoor",3040,"Achmea","Zorgkantoor Zwolle"]
[2574,"Home Instead Thuisservice Meierij Den Bosch B.V.",3280,"UVIT","Zorgkantoor Noordoost-Brabant"]
[2577,"Stichting Max-Huis Nederland",3070,"Menzis","Zorgkantoor Arnhem"]
[2578,"Stichting Careyn (West-Brabant)",3260,"CZ","Zorgkantoor West-Brabant"]
[2579,"Stichting Joyce-House Nederland (Groningen)",3010,"Menzis","Zorgkantoor Groningen"]
[2580,"Melius Zorg B.V. (Arnhem)",3070,"Menzis","Zorgkantoor Arnhem"]
[2581,"Dagelijks Leven (Noord-Oost Brabant)",3280,"UVIT","Zorgkantoor Noordoost-Brabant"]
[2582,"Dagelijks Leven (Apeldoorn-Zutphen)",3060,"Achmea","Zorgkantoor Apeldoorn/Zutphen"]
[2583,"Dagelijks Leven (Zuid-Oost Brabant)",3290,"CZ","Zorgkantoor Zuidoost-Brabant"]
[2584,"Dagelijks Leven (Zuid-Holland Noord)",3170,"ZorgZekerheid","Zorgkantoor Zuid-Holland Noord"]
[2585,"Dagelijks Leven (Midden-IJssel)",3061,"Salland","Zorgkantoor Midden IJssel"]
[2586,"Dagelijks Leven (Twente)",3050,"Menzis","Zorgkantoor Twente"]
[2587,"Dagelijks Leven (Delft Westland Oostland)",3190,"DSW","Zorgkantoor Delft Westland Oostland"]
[2588,"Stichting SamSamZorg",3060,"Achmea","Zorgkantoor Apeldoorn/Zutphen"]
[2591,"Thuiszorg Evital B.V. (Arnhem)",3070,"Menzis","Zorgkantoor Arnhem"]
[2592,"Home Instead Thuiszorg Tilburg (Midden Brabant)",3270,"UVIT","Zorgkantoor Midden-Brabant"]
[2593,"Dagelijks Leven  (Arnhem)",3070,"Menzis","Zorgkantoor Arnhem"]
[2594,"BeterZorg Leiden B.V./ Care2all p.a. Mr. R. Mons, curator",3170,"ZorgZekerheid","Zorgkantoor Zuid-Holland Noord"]
[2595,"Coöperatie ambulante zelfstandige zorg- en hulpverleners U.A.",3310,"CZ","Zorgkantoor Zuid-Limburg"]
[2596,"Het Houvast B.V.",3270,"UVIT","Zorgkantoor Midden-Brabant"]
[2597,"Vitaal Thuiszorg B.V. ('t Gooi)",3110,"Achmea","Zorgkantoor 't Gooi"]
[2598,"Stichting Thuiszorg De Lindeboom (Amstelland en De Meerlanden)",3160,"ZorgZekerheid","Zorgkantoor Amstelland en De Meerlanden"]
[2599,"Zorggroep Achterhoek B.V. (Twente)",3050,"Menzis","Zorgkantoor Twente"]
[2600,"Allerzorg B.V. (Delft Westland Oostland)",3190,"DSW","Zorgkantoor Delft Westland Oostland"]
[2601,"Elcare B.V.",3090,"Achmea","Zorgkantoor Utrecht"]
[2602,"Vinden & Binden Zorg en Welzijn",3210,"Achmea","Zorgkantoor Rotterdam"]
[2603,"Home Instead Midden-Limburg",3300,"UVIT","Zorgkantoor Noord en Midden Limburg"]
[2604,"BijZonder ZorgenKind B.V. (Zwolle)",3040,"Achmea","Zorgkantoor Zwolle"]
[2605,"KiZo Kinderthuiszorg/ExpertTcare B.V. (Friesland)",3020,"De Friesland","Zorgkantoor Friesland"]
[2606,"Cura Wonen Bodegraven",3200,"UVIT","Zorgkantoor Midden-Holland"]
[2608,"Melius Zorg B.V. (Rotterdam)",3210,"Achmea","Zorgkantoor Rotterdam"]
[2609,"Melius Zorg B.V. (Waardenland)",3240,"UVIT","Zorgkantoor Waardenland"]
[2610,"Thuiszorg Slippens B.V.",3020,"De Friesland","Zorgkantoor Friesland"]
[2611,"IN Zorg en Advies",3210,"Achmea","Zorgkantoor Rotterdam"]
[2612,"Vinden & Binden Zorg en Welzijn B.V. (Zuid-Oost Brabant)",3290,"CZ","Zorgkantoor Zuidoost-Brabant"]
[2613,"* Stichting Buurtzorg Nederland (Zuid-Limburg)",3310,"CZ","Zorgkantoor Zuid-Limburg"]
[2617,"Home Instead Eindhoven-West B.V.",3290,"CZ","Zorgkantoor Zuidoost-Brabant"]
[2618,"Stichting Laverhof",3280,"UVIT","Zorgkantoor Noordoost-Brabant"]
[2619,"KiZo Kinderthuiszorg / ExperTcare B.V.",3190,"DSW","Zorgkantoor Delft Westland Oostland"]
[2620,"Stichting Good4Life (Waardenland)",3240,"UVIT","Zorgkantoor Waardenland"]
[2621,"Stichting Curia Thuiszorg",3080,"UVIT","Zorgkantoor Nijmegen"]
[2622,"Stichting MaxZorg",3280,"UVIT","Zorgkantoor Noordoost-Brabant"]
[2624,"Stichting Ayudo",3210,"Achmea","Zorgkantoor Rotterdam"]
[2625,"Stichting Elzeneindhuis Oss",3280,"UVIT","Zorgkantoor Noordoost-Brabant"]
[2626,"Stichting Zorg en Onderwijs Nu",3260,"CZ","Zorgkantoor West-Brabant"]
[2628,"Stichting Profila Zorg (regio Rotterdam)",3210,"Achmea","Zorgkantoor Rotterdam"]
[2629,"MOB Maatschappelijk Ondersteuningsbureau B.V,",3160,"ZorgZekerheid","Zorgkantoor Amstelland en De Meerlanden"]
[2630,"Stichting Artidé Zorg",3310,"CZ","Zorgkantoor Zuid-Limburg"]
[2631,"DeniseZorg B.V.",3280,"UVIT","Zorgkantoor Noordoost-Brabant"]
[2632,"ChiqCare WoonZorg",3090,"Achmea","Zorgkantoor Utrecht"]
[2633,"JoVoZorg B.V. (Utrecht)",3090,"Achmea","Zorgkantoor Utrecht"]
[2637,"Stichting Thuiszorg Groot Limburg",3310,"CZ","Zorgkantoor Zuid-Limburg"]
[2638,"Raeger Autismecentrum (Rotterdam)",3210,"Achmea","Zorgkantoor Rotterdam"]
[2639,"Stichting Leger des Heils Welzijns- en Gezonheidszorg (Rotterdam)",3210,"Achmea","Zorgkantoor Rotterdam"]
[2640,"Coöperatie Hesterhuizen U.A. (Nijmegen)",3080,"UVIT","Zorgkantoor Nijmegen"]
[2641,"Koninklijke Visio Expertisecentrum voor Slechtziende en Blinde mensen (Rotterdam)",3210,"Achmea","Zorgkantoor Rotterdam"]
[2642,"Basis & Eenheid",3040,"Achmea","Zorgkantoor Zwolle"]
[2643,"Home Instead Thuisservice 't Gooi B.V.",3110,"Achmea","Zorgkantoor 't Gooi"]
[2644,"Stichting Profila Zorg",3240,"UVIT","Zorgkantoor Waardenland"]
[2645,"Yalisco Thuiszorg Groot Brabant B.V. (West-Brabant)",3260,"CZ","Zorgkantoor West-Brabant"]
[2646,"Zorggroep Achterhoek B.V. (Apeldoorn/Zutphen)",3060,"Achmea","Zorgkantoor Apeldoorn/Zutphen"]
[2647,"Stichting d'Oude Apotheek leer- en dagcentrum & Winkel",3260,"CZ","Zorgkantoor West-Brabant"]
[2648,"De Rozenhof",3050,"Menzis","Zorgkantoor Twente"]
[2649,"ZorgAZ B.V.",3150,"Achmea","Zorgkantoor Amsterdam"]
[2650,"'t Zuider Stee B.V.",3020,"De Friesland","Zorgkantoor Friesland"]
[2651,"Zorgt in Zorg B.V.",3150,"Achmea","Zorgkantoor Amsterdam"]
[2652,"ADLON Oost Nederland",3050,"Menzis","Zorgkantoor Twente"]
[2653,"Focus Op Zorg B.V.",3210,"Achmea","Zorgkantoor Rotterdam"]
[2654,"Stichting MIES",3140,"Achmea","Zorgkantoor Zaanstreek/Waterland"]
[2655,"CareCrew",3150,"Achmea","Zorgkantoor Amsterdam"]
[2656,"Thuis-Huis de Baander",3030,"Achmea","Zorgkantoor Drenthe"]
[2657,"Stichting Brunnera",3050,"Menzis","Zorgkantoor Twente"]
[2658,"Rosorum Zorgexploitatie B.V. (Zuid-Oost Brabant)",3290,"CZ","Zorgkantoor Zuidoost-Brabant"]
[2659,"Rosorum Zorgexploitatie B.V. (Arnhem)",3070,"Menzis","Zorgkantoor Arnhem"]
[2660,"Arja Zorg & Welzijn B.V.",3210,"Achmea","Zorgkantoor Rotterdam"]
[2661,"Zorgorganisatie Zorg-Vuldig B.V. (Waardenland)",3240,"UVIT","Zorgkantoor Waardenland"]
[2662,"AWZO",3040,"Achmea","Zorgkantoor Zwolle"]
[2663,"Home Instead Thuisservice Alphen aan den Rijn e.o. B.V.",3170,"ZorgZekerheid","Zorgkantoor Zuid-Holland Noord"]
[2664,"Wijkzorgzuidoost",3150,"Achmea","Zorgkantoor Amsterdam"]
[2665,"Altenastaete Thuiszorg B.V.",3260,"CZ","Zorgkantoor West-Brabant"]
[2666,"Stichting RijnmondZorg",3210,"Achmea","Zorgkantoor Rotterdam"]
[2667,"Zorgpunt Nederland B.V.",3090,"Achmea","Zorgkantoor Utrecht"]
[2669,"De Zorgerije",3030,"Achmea","Zorgkantoor Drenthe"]
[2670,"Stichting Zorgbruggen Thuiszorg",3270,"UVIT","Zorgkantoor Midden-Brabant"]
[2671,"Yalisco Thuiszorg Groot Brabant B.V. (Midden-Brabant)",3270,"UVIT","Zorgkantoor Midden-Brabant"]
[2673,"VraagPlus",3070,"Menzis","Zorgkantoor Arnhem"]
[2674,"Stichting Zorg voor Kidzz",3050,"Menzis","Zorgkantoor Twente"]
[2675,"Stepping Stones Home & Care Zorg B.V. (Noord en Midden Limburg)",3300,"UVIT","Zorgkantoor Noord en Midden Limburg"]
[2676,"Stepping Stones Home & Care Zorg B.V.",3270,"UVIT","Zorgkantoor Midden-Brabant"]
[2677,"VWE Zorg B.V.",3030,"Achmea","Zorgkantoor Drenthe"]
[2678,"Zorgboerderij Klein Arfman",3070,"Menzis","Zorgkantoor Arnhem"]
[2679,"Stichting Woonzorgboerderij Moriahoeve",3090,"Achmea","Zorgkantoor Utrecht"]
[2680,"Senioren Collectief Oosterhout B.V.",3260,"CZ","Zorgkantoor West-Brabant"]
[2681,"Stichting De Zorgnijverij",3230,"CZ","Zorgkantoor Zuid-Hollandse Eilanden"]
[2682,"Dennenhorst",3090,"Achmea","Zorgkantoor Utrecht"]
[2683,"Huys ter Swaach Verzorgd Wonen B.V.",3020,"De Friesland","Zorgkantoor Friesland"]
[2684,"Bos en Meerzicht Verzorgd Wonen B.V.",3020,"De Friesland","Zorgkantoor Friesland"]
[2685,"Stamhuys",3270,"UVIT","Zorgkantoor Midden-Brabant"]
[2686,"Zorgen voor de Zorg B.V.",3140,"Achmea","Zorgkantoor Zaanstreek/Waterland"]
[2687,"Stichting Het Max Plazier Huis",3120,"UVIT","Zorgkantoor Noord-Holland Noord"]
[2688,"Derman thuiszorg Gelderland",3070,"Menzis","Zorgkantoor Arnhem"]
[2689,"Centrum Zorg en Welzijn B.V. (Zuid-Holland Noord)",3170,"ZorgZekerheid","Zorgkantoor Zuid-Holland Noord"]
[2690,"Centrum Zorg en Welzijn B.V. (Haaglanden)",3180,"CZ","Zorgkantoor Haaglanden"]
[2691,"Zorgcoöperatie Improzorg U.A. (Haaglanden)",3180,"CZ","Zorgkantoor Haaglanden"]
[2692,"Zorgcoöperatie Improzorg U.A. (Zuid-Holland, Noord)",3170,"ZorgZekerheid","Zorgkantoor Zuid-Holland Noord"]
[2693,"Zorgcoöperatie Improzorg U.A. (Zaanstreek-Waterland)",3140,"Achmea","Zorgkantoor Zaanstreek/Waterland"]
[2694,"Zorgcoöperatie Improzorg U.A. (Waardenland)",3240,"UVIT","Zorgkantoor Waardenland"]
[2695,"Zorgcoöperatie Improzorg U.A. (Amsterdam)",3150,"Achmea","Zorgkantoor Amsterdam"]
[2697,"Coöperatie In-samenwerking LVG en Psychiatrie plus U.A. (Zwolle)",3040,"Achmea","Zorgkantoor Zwolle"]
[2698,"Stichting Oost Nederland",3050,"Menzis","Zorgkantoor Twente"]
[2699,"Meerstadt Zorg Centrum",3210,"Achmea","Zorgkantoor Rotterdam"]
[2700,"Erbij Dagbesteding B.V.",3280,"UVIT","Zorgkantoor Noordoost-Brabant"]
[2701,"Maatwerk Wonen +",3300,"UVIT","Zorgkantoor Noord en Midden Limburg"]
[2702,"Coöperatie In-samenwerking LVG en Psychiatrie plus U.A. (Friesland)",3020,"De Friesland","Zorgkantoor Friesland"]
[2703,"Stichting Ipse de Bruggen (Rotterdam)",3210,"Achmea","Zorgkantoor Rotterdam"]
[2704,"Coöperatie In-samenwerking LVG en Psychiatrie plus U.A. (Groningen)",3010,"Menzis","Zorgkantoor Groningen"]
[2705,"THUIS met Zorg Zaanstreek B.V.",3140,"Achmea","Zorgkantoor Zaanstreek/Waterland"]
[2706,"Zorggroep 't Achterhuus B.V.",3030,"Achmea","Zorgkantoor Drenthe"]
[2707,"Stichting Joyce-House Nederland",3020,"De Friesland","Zorgkantoor Friesland"]
[2708,"Medispec Care B.V.",3210,"Achmea","Zorgkantoor Rotterdam"]
[2709,"Rivas Zorggroep",3240,"UVIT","Zorgkantoor Waardenland"]
[2710,"Op Mezelf B.V.",3310,"CZ","Zorgkantoor Zuid-Limburg"]
[2711,"Stichting Lyvore",3090,"Achmea","Zorgkantoor Utrecht"]
[2712,"Leefstijlpraktijk Salland",3040,"Achmea","Zorgkantoor Zwolle"]
[2713,"Triade (Flevoland)",3100,"Achmea","Zorgkantoor Flevoland"]
[2714,"Stichting Liberein",3050,"Menzis","Zorgkantoor Twente"]
[2715,"ZorgSaam Thuis- en Ouderenzorg B.V.",3250,"CZ","Zorgkantoor Zeeland"]
[2716,"Sigma ZorG B.V.",3150,"Achmea","Zorgkantoor Amsterdam"]
[2717,"SVRZ (Stichting Voor Regionale Zorgverlening Zeeland)",3250,"CZ","Zorgkantoor Zeeland"]
[2718,"Feyza Care B.V.",3240,"UVIT","Zorgkantoor Waardenland"]
[2719,"Home Instead Thuisservice Nijmegen",3080,"UVIT","Zorgkantoor Nijmegen"]
[2720,"KennemerHart",3130,"Achmea","Zorgkantoor Kennemerland"]
[2721,"Dichterbij",3080,"UVIT","Zorgkantoor Nijmegen"]
[2722,"Care Plus Stichting",3300,"UVIT","Zorgkantoor Noord en Midden Limburg"]
[2723,"Stichting Steunpunt Zorg & Onderwijs Fryslán",3020,"De Friesland","Zorgkantoor Friesland"]
[2724,"Wijkzorg Regio Utrecht B.V.",3090,"Achmea","Zorgkantoor Utrecht"]
[2725,"Home Instead Thuisservice Nijmegen B.V.",3070,"Menzis","Zorgkantoor Arnhem"]
[2726,"Ontzorgd Wonen Nederland B.V.",3280,"UVIT","Zorgkantoor Noordoost-Brabant"]
[2727,"Stichting Vleugelzorg",3300,"UVIT","Zorgkantoor Noord en Midden Limburg"]
[2728,"Home Instead Thuisservice Apeldoorn B.V.",3060,"Achmea","Zorgkantoor Apeldoorn/Zutphen"]
[2729,"Stichting Centrum Begeleiding Zorg",3090,"Achmea","Zorgkantoor Utrecht"]
[2730,"Coöperatie ambulante zelfstandige zorg- en hulpverleners U.A.",3300,"UVIT","Zorgkantoor Noord en Midden Limburg"]
[2731,"Stichting IVT thuiszorg",3280,"UVIT","Zorgkantoor Noordoost-Brabant"]
[2732,"De Waggelmannetjes",3150,"Achmea","Zorgkantoor Amsterdam"]
[2733,"Elite Human Service B.V.",3090,"Achmea","Zorgkantoor Utrecht"]
[2734,"Stichting Marente",3170,"ZorgZekerheid","Zorgkantoor Zuid-Holland Noord"]
[2735,"Zorghuis Nederland Holding B.V.",3300,"UVIT","Zorgkantoor Noord en Midden Limburg"]
[2736,"Stichting Hart voor Zorg en Welzijn Limburg",3310,"CZ","Zorgkantoor Zuid-Limburg"]
[2737,"Coöperatie Hesterhuizen U.A. (Haaglanden)",3180,"CZ","Zorgkantoor Haaglanden"]
[2738,"William Schrikker Stichting Zorg & Wonen",3180,"CZ","Zorgkantoor Haaglanden"]
[2739,"Candeas Thuiszorg B.V.",3150,"Achmea","Zorgkantoor Amsterdam"]
[2740,"MartiniZorg B.V. (Drenthe)",3030,"Achmea","Zorgkantoor Drenthe"]
[2741,"Stichting Nusantara Zorg (Arnhem)",3070,"Menzis","Zorgkantoor Arnhem"]
[2742,"Stg. 's Heeren Loo Zorggroep Regio Zuid Holland Noord",3160,"ZorgZekerheid","Zorgkantoor Amstelland en De Meerlanden"]
[2743,"Stg. 's Heerenloo Zorggroep Regio Noord-West Nederland",3150,"Achmea","Zorgkantoor Amsterdam"]
[2744,"De Nieuwe Zorg",3050,"Menzis","Zorgkantoor Twente"]
[2745,"De Nieuwe Zorg",3070,"Menzis","Zorgkantoor Arnhem"]
[2746,"*Zorgpunt Nederland B.V.",3080,"UVIT","Zorgkantoor Nijmegen"]
[2747,"Talent B.V.",3300,"UVIT","Zorgkantoor Noord en Midden Limburg"]
[2748,"Jade Wonen B.V.",3050,"Menzis","Zorgkantoor Twente"]
[2749,"De Karmel Plus B.V.",3070,"Menzis","Zorgkantoor Arnhem"]
[2751,"Leyhoeve Zorg B.V.",3010,"Menzis","Zorgkantoor Groningen"]
[2752,"*Zorgpunt Nederland B.V.",3070,"Menzis","Zorgkantoor Arnhem"]
[2753,"MartiniZorg B.V.",3020,"De Friesland","Zorgkantoor Friesland"]
[2754,"Stichting Omniazorg",3210,"Achmea","Zorgkantoor Rotterdam"]
[2755,"Zorg & Opvang Holding B.V.",3150,"Achmea","Zorgkantoor Amsterdam"]
[2756,"Stepping Stones Home & Care Zorg B.V. (Twente)",3050,"Menzis","Zorgkantoor Twente"]
[2757,"Stichting Zozijn Zorg (Twente)",3050,"Menzis","Zorgkantoor Twente"]
[2758,"Stichting Urtica",3070,"Menzis","Zorgkantoor Arnhem"]
[2760,"Bijzonder ZorgenKind B.V.",3020,"De Friesland","Zorgkantoor Friesland"]
[2761,"SYS ZORG",3130,"Achmea","Zorgkantoor Kennemerland"]
[2762,"Valuas Zorg B.V.",3090,"Achmea","Zorgkantoor Utrecht"]
[2763,"September Apeldoorn B.V.",3060,"Achmea","Zorgkantoor Apeldoorn/Zutphen"]
[2764,"Zorgboerderij Ensink",3050,"Menzis","Zorgkantoor Twente"]
[2765,"De Karmel Zorg B.V.",3070,"Menzis","Zorgkantoor Arnhem"]
[2766,"Coöperatie Hesterhuizen U.A. (Friesland)",3020,"De Friesland","Zorgkantoor Friesland"]
[2767,"Stichting Zideris",3160,"ZorgZekerheid","Zorgkantoor Amstelland en De Meerlanden"]
[2768,"Sa-Net Wonen B.V.",3060,"Achmea","Zorgkantoor Apeldoorn/Zutphen"]
[2769,"Cooperatie Zorgprofessionals Twente U.A.",3070,"Menzis","Zorgkantoor Arnhem"]
[2770,"Bions",3050,"Menzis","Zorgkantoor Twente"]
[2771,"Cooperatie Hesterhuizen U.A. (Groningen)",3010,"Menzis","Zorgkantoor Groningen"]
[2772,"Dunya Zorg en Welzijn B.V.",3200,"UVIT","Zorgkantoor Midden-Holland"]
[2773,"Coöperatie Hesterhuizen U.A. (Arnhem)",3070,"Menzis","Zorgkantoor Arnhem"]
[2774,"Zorg uit Handen B.V.",3040,"Achmea","Zorgkantoor Zwolle"]
[2775,"Coöperatie Hesterhuizen U.A. (Twente)",3050,"Menzis","Zorgkantoor Twente"]
[2776,"Miep B.V.",3120,"UVIT","Zorgkantoor Noord-Holland Noord"]
[2777,"ExperTcare B.V.",3010,"Menzis","Zorgkantoor Groningen"]
[2778,"Kinderhotel Mappa Mondo B.V.",3020,"De Friesland","Zorgkantoor Friesland"]
[2779,"ExperTcare B.V.",3070,"Menzis","Zorgkantoor Arnhem"]
[2780,"Zuidzorg Heuvelland",3310,"CZ","Zorgkantoor Zuid-Limburg"]
[2781,"William Schrikker Stichting Zorg & Wonen",3050,"Menzis","Zorgkantoor Twente"]
[2782,"ExperTcare B.V.",3050,"Menzis","Zorgkantoor Twente"]
[2783,"Eminent Wonen & Zorg B.V.",3070,"Menzis","Zorgkantoor Arnhem"]
[2784,"William Schrikker Stichting Zorg & Wonen",3070,"Menzis","Zorgkantoor Arnhem"]
[2785,"Omega Groep B.V.",3010,"Menzis","Zorgkantoor Groningen"]
[2786,"Zorg Allerlei B.V.",3130,"Achmea","Zorgkantoor Kennemerland"]
[2787,"Stichting Thuisgenoten",3090,"Achmea","Zorgkantoor Utrecht"]
[2788,"Stichting Art Loca",3090,"Achmea","Zorgkantoor Utrecht"]
[2789,"Ambachtzorg B.V.",3210,"Achmea","Zorgkantoor Rotterdam"]
[2790,"Chiron Zorg",3180,"CZ","Zorgkantoor Haaglanden"]
[2791,"Riadzorg BV",3050,"Menzis","Zorgkantoor Twente"]
[2792,"Stichting Art Loca",3110,"Achmea","Zorgkantoor 't Gooi"]
[2793,"Home Instead Thuisservice Amstelland",3160,"ZorgZekerheid","Zorgkantoor Amstelland en De Meerlanden"]
[2794,"Smart Coach B.V.",3280,"UVIT","Zorgkantoor Noordoost-Brabant"]
[2795,"Woonbegeleiding Nederland B.V.",3280,"UVIT","Zorgkantoor Noordoost-Brabant"]
[2796,"Actief Zorg",3090,"Achmea","Zorgkantoor Utrecht"]
[2797,"CrossOverCare",3100,"Achmea","Zorgkantoor Flevoland"]
[2799,"Stichting Plekzat",3030,"Achmea","Zorgkantoor Drenthe"]
[2800,"Zorghaven B.V.",3190,"DSW","Zorgkantoor Delft Westland Oostland"]
[2801,"Ambachtzorg B.V.",3230,"CZ","Zorgkantoor Zuid-Hollandse Eilanden"]
[2802,"Thuiszorg Pelgromhof B.V.",3070,"Menzis","Zorgkantoor Arnhem"]
[2803,"Medi3lse Coöperatief U.A.",3090,"Achmea","Zorgkantoor Utrecht"]
[2804,"Wellness Praktijk Therlisana",3020,"De Friesland","Zorgkantoor Friesland"]
[2805,"Wellness Praktijk Therlisana",3160,"ZorgZekerheid","Zorgkantoor Amstelland en De Meerlanden"]
[2806,"Gezinshuis Zwaagdijk, De Bedstee",3120,"UVIT","Zorgkantoor Noord-Holland Noord"]
[2807,"Fortress Zorg B.V.",3150,"Achmea","Zorgkantoor Amsterdam"]
[2808,"Huis de Merwede B.V.",3240,"UVIT","Zorgkantoor Waardenland"]
[2810,"Wellness Praktijk Therlisana",3150,"Achmea","Zorgkantoor Amsterdam"]
[2811,"MultiMaat",3010,"Menzis","Zorgkantoor Groningen"]
[2812,"Bella Vita Beek",3310,"CZ","Zorgkantoor Zuid-Limburg"]
[2814,"MultiMaat",3030,"Achmea","Zorgkantoor Drenthe"]
[2815,"De Bijenkooi NAH B.V.",3260,"CZ","Zorgkantoor West-Brabant"]
[2816,"HGH Het Gouden Hart Kampen B.V.",3040,"Achmea","Zorgkantoor Zwolle"]
[2817,"Thuiszorg M.O.C.",3080,"UVIT","Zorgkantoor Nijmegen"]
[2819,"Relaxzorg",3050,"Menzis","Zorgkantoor Twente"]
[2820,"Stichting Dais Personalcare",3150,"Achmea","Zorgkantoor Amsterdam"]
[2821,"Stichting Landzijde",3120,"UVIT","Zorgkantoor Noord-Holland Noord"]
[2822,"September Twello B.V.",3061,"Salland","Zorgkantoor Midden IJssel"]
[2823,"September Arnhem B.V.",3070,"Menzis","Zorgkantoor Arnhem"]
[2824,"September Witmarsum B.V.",3020,"De Friesland","Zorgkantoor Friesland"]
[2825,"September Wageningen B.V.",3070,"Menzis","Zorgkantoor Arnhem"]
[2826,"September Zevenaar B.V.",3070,"Menzis","Zorgkantoor Arnhem"]
[2827,"Ranonkel Wonen B.V.",3240,"UVIT","Zorgkantoor Waardenland"]
[2828,"NOBAMA Care B.V.",3310,"CZ","Zorgkantoor Zuid-Limburg"]
[2829,"Stichting Arbeidsgewenning",3040,"Achmea","Zorgkantoor Zwolle"]
[2830,"Huize Spoorzicht B.V.",3090,"Achmea","Zorgkantoor Utrecht"]
[2831,"Thuiszorg La Vie",3140,"Achmea","Zorgkantoor Zaanstreek/Waterland"]
[2832,"Teamzorg B.V.",3080,"UVIT","Zorgkantoor Nijmegen"]
[2833,"Homecare Geloof, Hoop & Liefde",3180,"CZ","Zorgkantoor Haaglanden"]
[2834,"Fivoor B.V.",3090,"Achmea","Zorgkantoor Utrecht"]
[2835,"Stichting Het Thuisgevoel",3050,"Menzis","Zorgkantoor Twente"]
[2836,"Stichting WIJ ZORG",3070,"Menzis","Zorgkantoor Arnhem"]
[2837,"Coöperatie ambulante zelfstandige zorg- en hulpverleners U.A.",3150,"Achmea","Zorgkantoor Amsterdam"]
[2838,"Klein Buitenhof",3090,"Achmea","Zorgkantoor Utrecht"]
[2839,"De Amanshoeve Zorg B.V.",3050,"Menzis","Zorgkantoor Twente"]
[2840,"Home Instead Thuisservice Ede-Wageningen B.V",3070,"Menzis","Zorgkantoor Arnhem"]
[2842,"De Amanshoeve Zorgverlening B.V.",3050,"Menzis","Zorgkantoor Twente"]
[2843,"Harmoniezorg B.V.",3050,"Menzis","Zorgkantoor Twente"]
[2844,"Stichting Acare Thuiszorg",3070,"Menzis","Zorgkantoor Arnhem"]
[2845,"Evitaa B.V.",3080,"UVIT","Zorgkantoor Nijmegen"]
[2846,"Ter Wal Woonzorg B.V.",3260,"CZ","Zorgkantoor West-Brabant"]
[2847,"Omega Groep B.V.",3020,"De Friesland","Zorgkantoor Friesland"]
[2848,"Stichting de Beuk",3050,"Menzis","Zorgkantoor Twente"]
[2849,"Baas Zorg B.V.",3070,"Menzis","Zorgkantoor Arnhem"]
[2850,"Compact Zorg B.V.",3150,"Achmea","Zorgkantoor Amsterdam"]
[2851,"Mijn Zorgstad",3210,"Achmea","Zorgkantoor Rotterdam"]
[2853,"Stichting Zorgplatform Geranòs",3090,"Achmea","Zorgkantoor Utrecht"]
[2854,"Stichting Fledderushoeve",3030,"Achmea","Zorgkantoor Drenthe"]
[2856,"Dani Care - wonen en zorg B.V.",3150,"Achmea","Zorgkantoor Amsterdam"]
[2857,"Zorghaven BV",3210,"Achmea","Zorgkantoor Rotterdam"]
[2858,"B.V. Zorg-en Dienstverleningsorganisatie Ja Zuster, Nee zuster",3150,"Achmea","Zorgkantoor Amsterdam"]
[2859,"Hasman Helpende Hand",3270,"UVIT","Zorgkantoor Midden-Brabant"]
[2860,"Zorghaven B.V.",3240,"UVIT","Zorgkantoor Waardenland"]
[2861,"Stichting Evean Zorg",3170,"ZorgZekerheid","Zorgkantoor Zuid-Holland Noord"]
[2862,"Stichting Evean Zorg",3180,"CZ","Zorgkantoor Haaglanden"]
[2863,"Pratica B.V.",3090,"Achmea","Zorgkantoor Utrecht"]
[2867,"Stichting Ipse de Bruggen",3200,"UVIT","Zorgkantoor Midden-Holland"]
[2868,"Lobie Care b.v.",3090,"Achmea","Zorgkantoor Utrecht"]
[2870,"Prinsenstichting",3120,"UVIT","Zorgkantoor Noord-Holland Noord"]
[2872,"Stichting Philadelphia Zorg Amstelland",3160,"ZorgZekerheid","Zorgkantoor Amstelland en De Meerlanden"]
[2873,"Rinette Zorg B.V.",3290,"CZ","Zorgkantoor Zuidoost-Brabant"]
[2874,"ZorgService Thuiz B.V.",3210,"Achmea","Zorgkantoor Rotterdam"]
[2875,"Woon- en zorgcentrum Nieuw Boschzicht",3090,"Achmea","Zorgkantoor Utrecht"]
[2876,"Compleet Zorg Achterhoek B.V.",3070,"Menzis","Zorgkantoor Arnhem"]
[2877,"Stichting Orion",3200,"UVIT","Zorgkantoor Midden-Holland"]
[2878,"Coöperatie ambulante zelfstandige zorg- en hulpverleners U.A.",3160,"ZorgZekerheid","Zorgkantoor Amstelland en De Meerlanden"]
[2879,"Stichting Zorgvoorziening Bloemendael",3090,"Achmea","Zorgkantoor Utrecht"]
[2880,"Stichting Evean Zorg",3210,"Achmea","Zorgkantoor Rotterdam"]
[2881,"Schouderaanschouder",3030,"Achmea","Zorgkantoor Drenthe"]
[2882,"Meetingcare B.V.",3270,"UVIT","Zorgkantoor Midden-Brabant"]
[2883,"Thuiszorg Elele B.V.",3080,"UVIT","Zorgkantoor Nijmegen"]
[2884,"Blinq Dagbesteding b.v.",3280,"UVIT","Zorgkantoor Noordoost-Brabant"]
[2885,"Signtaal",3180,"CZ","Zorgkantoor Haaglanden"]
[2886,"De-Bruggen (V.O.F)",3030,"Achmea","Zorgkantoor Drenthe"]
[2887,"Wijkverpleging Carpe Diem U.A.",3160,"ZorgZekerheid","Zorgkantoor Amstelland en De Meerlanden"]
[2888,"De Waagschaal",3030,"Achmea","Zorgkantoor Drenthe"]
[2889,"Stichting De Riethorst Stromenland",3270,"UVIT","Zorgkantoor Midden-Brabant"]
[2890,"De Pastorie Zorg B.V.",3280,"UVIT","Zorgkantoor Noordoost-Brabant"]
[2891,"Siloah (Flevoland)",3100,"Achmea","Zorgkantoor Flevoland"]
[2892,"Unieck Zorg",3200,"UVIT","Zorgkantoor Midden-Holland"]
[2893,"Parelhoenderhoeve b.v.",3120,"UVIT","Zorgkantoor Noord-Holland Noord"]
[2894,"Delphinium B.V.",3310,"CZ","Zorgkantoor Zuid-Limburg"]
[2895,"Zorggroep Valide B.V.",3100,"Achmea","Zorgkantoor Flevoland"]
[2896,"BFM Thuiszorg B.V.",3300,"UVIT","Zorgkantoor Noord en Midden Limburg"]
[2897,"Aster Zorg B.V.",3050,"Menzis","Zorgkantoor Twente"]
[2898,"A+ Care B.V.",3180,"CZ","Zorgkantoor Haaglanden"]
[2899,"De Molenhof Werkendam",3260,"CZ","Zorgkantoor West-Brabant"]
[2900,"Palliatief Thuiszorg Nederland B.V.",3110,"Achmea","Zorgkantoor 't Gooi"]
[2901,"Stichting Surplus",3260,"CZ","Zorgkantoor West-Brabant"]
[2902,"Coöperatie Boer en Zorg B.A.",3050,"Menzis","Zorgkantoor Twente"]
[2903,"La Hacienda",3010,"Menzis","Zorgkantoor Groningen"]
[2904,"Stichting Nova Kind-Jeugdcentrum",3090,"Achmea","Zorgkantoor Utrecht"]
[2905,"DZN B.V.",3080,"UVIT","Zorgkantoor Nijmegen"]
[2906,"Home Instead Thuisservice Haaglanden Zuid & Oost B.V.",3190,"DSW","Zorgkantoor Delft Westland Oostland"]
[2907,"Stichting Zorgerf Waarland",3120,"UVIT","Zorgkantoor Noord-Holland Noord"]
[2908,"Stichting Forsa Amsterdam",3150,"Achmea","Zorgkantoor Amsterdam"]
[2909,"Aangenaam Zorg B.V.",3090,"Achmea","Zorgkantoor Utrecht"]
[2910,"WelThuis B.V.",3210,"Achmea","Zorgkantoor Rotterdam"]
[2911,"Stichting Tenderhands Care (Flevoland)",3100,"Achmea","Zorgkantoor Flevoland"]
[2912,"Stichting Tenderhands Care ('t Gooi)",3110,"Achmea","Zorgkantoor 't Gooi"]
[2913,"Stichting Tenderhands Care (Utrecht)",3090,"Achmea","Zorgkantoor Utrecht"]
[2914,"Stichting Tenderhands Care (Amsterdam)",3150,"Achmea","Zorgkantoor Amsterdam"]
[2916,"Stichting Magentazorg",3120,"UVIT","Zorgkantoor Noord-Holland Noord"]
[2917,"Ambulante Zorg Twente",3050,"Menzis","Zorgkantoor Twente"]
[2918,"Stichting KleinGeluk",3060,"Achmea","Zorgkantoor Apeldoorn/Zutphen"]
[2919,"Stichting Santé Zorg STMR",3080,"UVIT","Zorgkantoor Nijmegen"]
[2920,"Home Instead Thuisservice (Zeist)",3090,"Achmea","Zorgkantoor Utrecht"]
[2921,"Linc naar Zorg B.V.",3280,"UVIT","Zorgkantoor Noordoost-Brabant"]
[2922,"NJ Welzijn",3080,"UVIT","Zorgkantoor Nijmegen"]
[2924,"Stichting Humanitas DMH",3280,"UVIT","Zorgkantoor Noordoost-Brabant"]
[2925,"Stichting Humanitas DMH",3230,"CZ","Zorgkantoor Zuid-Hollandse Eilanden"]
[2927,"B-Point Klepel B.V.",3040,"Achmea","Zorgkantoor Zwolle"]
[2928,"NovaFarm-Grip B.V.",3280,"UVIT","Zorgkantoor Noordoost-Brabant"]
[2929,"NovaFarm-Grip B.V.",3290,"CZ","Zorgkantoor Zuidoost-Brabant"]
[2930,"Dunya woonzorg B.V.",3070,"Menzis","Zorgkantoor Arnhem"]
[2931,"Feyza Care B.V.",3210,"Achmea","Zorgkantoor Rotterdam"]
[2932,"Stichting Carinova Woonzorg",3050,"Menzis","Zorgkantoor Twente"]
[2933,"Actief Zorg B.V.",3270,"UVIT","Zorgkantoor Midden-Brabant"]
[2934,"Royaal Zorg B.V.",3180,"CZ","Zorgkantoor Haaglanden"]
[2935,"Forensisch Centrum Delictpreventie en Resocialisatie B.V.",3150,"Achmea","Zorgkantoor Amsterdam"]
[2936,"Top Wijkzorg",3120,"UVIT","Zorgkantoor Noord-Holland Noord"]
[2937,"Parzival Wonen B.V.",3230,"CZ","Zorgkantoor Zuid-Hollandse Eilanden"]
[2938,"Coöperatie Hesterhuizen U.A. (Flevoland)",3100,"Achmea","Zorgkantoor Flevoland"]
[2939,"S.V.V.G. De Schutse",3090,"Achmea","Zorgkantoor Utrecht"]
[2940,"Stichting Inaya Zorg",3090,"Achmea","Zorgkantoor Utrecht"]
[2941,"Coöperatie Hesterhuizen U.A. ('t Gooi)",3110,"Achmea","Zorgkantoor 't Gooi"]
[2942,"Cooperatie MenZZorg U.A.",3300,"UVIT","Zorgkantoor Noord en Midden Limburg"]
[2943,"Stichting de Hartekamp Groep",3170,"ZorgZekerheid","Zorgkantoor Zuid-Holland Noord"]
[2944,"Home Instead Thuisservice Leiden e.o. B.V.",3170,"ZorgZekerheid","Zorgkantoor Zuid-Holland Noord"]
[2945,"Stichting de Hartekamp Groep",3160,"ZorgZekerheid","Zorgkantoor Amstelland en De Meerlanden"]
[2946,"Nieuwe Start Woonzorg",3270,"UVIT","Zorgkantoor Midden-Brabant"]
[2947,"Stichting Dimence Groep",3050,"Menzis","Zorgkantoor Twente"]
[2948,"Gendersupport Netherlands B.V.",3150,"Achmea","Zorgkantoor Amsterdam"]
[2949,"Stichting ABC Zorg",3300,"UVIT","Zorgkantoor Noord en Midden Limburg"]
[2950,"William Schrikker Stichting Zorg & Wonen",3260,"CZ","Zorgkantoor West-Brabant"]
[2951,"Thuishaven Heerhugowaard",3120,"UVIT","Zorgkantoor Noord-Holland Noord"]
[2952,"Dolfijnenhuis begeleiding B.V.",3040,"Achmea","Zorgkantoor Zwolle"]
[2953,"DMS Zorg B.V.",3140,"Achmea","Zorgkantoor Zaanstreek/Waterland"]
[2954,"Stichting Alice Thuiszorg",3150,"Achmea","Zorgkantoor Amsterdam"]
[2955,"Coöperatieve ambulante zelfstandige zorg- en hulpverleners U.A.",3070,"Menzis","Zorgkantoor Arnhem"]
[2956,"Stichting Medical",3140,"Achmea","Zorgkantoor Zaanstreek/Waterland"]
[2957,"GVT Syndion (regio Brabant)",3260,"CZ","Zorgkantoor West-Brabant"]
[2958,"Su international Zorg B.V.",3060,"Achmea","Zorgkantoor Apeldoorn/Zutphen"]
[2959,"T.H.M.B. Geutjes en E.A.M. van Putten h.o.d.n. Home Instead Thuisservice Deventer Lochem Zutphen",3070,"Menzis","Zorgkantoor Arnhem"]
[2960,"Unieke Thuiszorg B.V.",3070,"Menzis","Zorgkantoor Arnhem"]
[2961,"Stichting Zorgpartners Midden-Holland",3170,"ZorgZekerheid","Zorgkantoor Zuid-Holland Noord"]
[2962,"Valuas Zorg B.V.",3020,"De Friesland","Zorgkantoor Friesland"]
[2963,"Stichting Voja",3210,"Achmea","Zorgkantoor Rotterdam"]
[2964,"Onder de Bomen BV",3080,"UVIT","Zorgkantoor Nijmegen"]
[2965,"Leermakers Langdurige Zorg B.V.",3280,"UVIT","Zorgkantoor Noordoost-Brabant"]
[2966,"J. Leijden van Amstel-Trip & C. Leijden van Amstel t.h.o.d.n. Home Instead Thuisservice Waterland",3140,"Achmea","Zorgkantoor Zaanstreek/Waterland"]
[2967,"Felay Thuiszorg B.V.",3190,"DSW","Zorgkantoor Delft Westland Oostland"]
[2968,"Dunya Zorg en Welzijn B.V.",3260,"CZ","Zorgkantoor West-Brabant"]
[2969,"Coöperatie Zelfstandige Zorgprofessionals U.A.",3280,"UVIT","Zorgkantoor Noordoost-Brabant"]
[2970,"Stichting Brunnera",3070,"Menzis","Zorgkantoor Arnhem"]
[2971,"Wonen bij September B.V.",3050,"Menzis","Zorgkantoor Twente"]
[2972,"J&J Totale Zorg B.V.",3270,"UVIT","Zorgkantoor Midden-Brabant"]
[2973,"Aristo Zorg B.V.",3130,"Achmea","Zorgkantoor Kennemerland"]
[2974,"MOB Maatschappelijk Ondersteuningsbureau B.V.",3190,"DSW","Zorgkantoor Delft Westland Oostland"]
[2975,"Adonai Zorg B.V.",3150,"Achmea","Zorgkantoor Amsterdam"]
[2976,"Eminent Wonen & Zorg Enschede B.V.",3050,"Menzis","Zorgkantoor Twente"]
[2977,"HappyNurse Thuiszorg B.V.",3270,"UVIT","Zorgkantoor Midden-Brabant"]
[2978,"Stichting Trajectum",3061,"Salland","Zorgkantoor Midden IJssel"]
[2979,"Stichting GGZ Drenthe",3010,"Menzis","Zorgkantoor Groningen"]
[2980,"Home Instead Amstelland en de Meerlanden B.V.",3170,"ZorgZekerheid","Zorgkantoor Zuid-Holland Noord"]
[2981,"Stichting de Trans",3010,"Menzis","Zorgkantoor Groningen"]
[6889,"P. Timmermans",3080,"UVIT","Zorgkantoor Nijmegen"]
[6890,"Huidtherapie Potters",3260,"CZ","Zorgkantoor West-Brabant"]

{"sheet":"Data CAO 2019 (verbergen)","index":13,"n_rows":208,"n_cols":24,"rows_kept":208,"cut":false,"hidden":true,"merged":[]}
[null,null,null,null,null,null,1,null,null,null,"Wonen",0.60599999999999998,null,null,null,"DB",0.61799999999999999,null,null,null,"BH",0.47399999999999998]
["FWG/trede","GHZ","VVT","GGZ",null,"FWG/trede","GHZ","VVT","GGZ",null,"FWG/trede","GHZ","VVT","GGZ",null,"FWG/trede","GHZ","VVT","GGZ",null,"FWG/trede","GHZ","VVT","GGZ"]
["10/0",{"$f":"IFERROR(VLOOKUP(A3,'Data CAO GHZ 2019 (verbergen)'!C:K,9,0),\"NVT\")","v":14.492811501597444},{"$f":"IFERROR(VLOOKUP(A3,'Data CAO VVT 2019 (verbergen)'!C:M,11,0),\"NVT\")","v":14.140607207667731},{"$f":"IFERROR(VLOOKUP(A3,'Data CAO GGZ 2019 (verbergen)'!C:M,11,0),\"NVT\")","v":14.816587859424923},null,10,{"$f":"AVERAGE(B3:B13)/$G$1","v":16.688117194307292},14.854779095207666,16.562428115015976,null,10,{"$f":"G3/$L$1","v":27.538147185325567},24.512836790771729,27.330739463722733,null,10,{"$f":"G3/$Q$1","v":27.003425880756136},24.036859377358684,26.800045493553359,null,10,{"$f":"G3/$V$1","v":35.20699830022636},31.339196403391703,34.94183146627843]
["10/1",{"$f":"IFERROR(VLOOKUP(A4,'Data CAO GHZ 2019 (verbergen)'!C:K,9,0),\"NVT\")","v":14.758386581469649},{"$f":"IFERROR(VLOOKUP(A4,'Data CAO VVT 2019 (verbergen)'!C:M,11,0),\"NVT\")","v":14.407767424920126},{"$f":"IFERROR(VLOOKUP(A4,'Data CAO GGZ 2019 (verbergen)'!C:M,11,0),\"NVT\")","v":15.363603833865815},null,15,{"$f":"AVERAGE(B14:B25)/$G$1","v":17.437849440894567},17.527086367057152,17.305510543130989,null,15,{"$f":"G4/$L$1","v":28.775329110387077},28.922584764120714,28.556948090975229,null,15,{"$f":"G4/$Q$1","v":28.216584855816453},28.360981176467885,28.002444244548528,null,15,{"$f":"G4/$V$1","v":36.78871190062145},36.976975457926478,36.509515913778458]
["10/2",{"$f":"IFERROR(VLOOKUP(A5,'Data CAO GHZ 2019 (verbergen)'!C:K,9,0),\"NVT\")","v":15.327476038338656},{"$f":"IFERROR(VLOOKUP(A5,'Data CAO VVT 2019 (verbergen)'!C:M,11,0),\"NVT\")","v":14.674831782747601},{"$f":"IFERROR(VLOOKUP(A5,'Data CAO GGZ 2019 (verbergen)'!C:M,11,0),\"NVT\")","v":15.655974440894568},null,20,{"$f":"AVERAGE(B26:B37)/$G$1","v":18.442450412673058},18.555636694355698,18.085822828928261,null,20,{"$f":"G5/$L$1","v":30.433086489559503},30.619862531940097,29.844592126944328,null,20,{"$f":"G5/$Q$1","v":29.842152771315629},30.025302094426696,29.265085483702688,null,20,{"$f":"G5/$V$1","v":38.908123233487466},39.146912857290502,38.155744364827555]
["10/3",{"$f":"IFERROR(VLOOKUP(A6,'Data CAO GHZ 2019 (verbergen)'!C:K,9,0),\"NVT\")","v":15.896565495207664},{"$f":"IFERROR(VLOOKUP(A6,'Data CAO VVT 2019 (verbergen)'!C:M,11,0),\"NVT\")","v":15.246058095846646},{"$f":"IFERROR(VLOOKUP(A6,'Data CAO GGZ 2019 (verbergen)'!C:M,11,0),\"NVT\")","v":16.070952076677315},null,25,{"$f":"AVERAGE(B38:B49)/$G$1","v":19.478667465388714},19.411504788498405,19.127553877432472,null,25,{"$f":"G6/$L$1","v":32.143015619453323},32.032186119634332,31.563620259789559,null,25,{"$f":"G6/$Q$1","v":31.518879393832872},31.410201923136579,30.950734429502383,null,25,{"$f":"G6/$V$1","v":41.094235159047919},40.952541747886933,40.353489192895516]
["10/4",{"$f":"IFERROR(VLOOKUP(A7,'Data CAO GHZ 2019 (verbergen)'!C:K,9,0),\"NVT\")","v":16.190595047923324},{"$f":"IFERROR(VLOOKUP(A7,'Data CAO VVT 2019 (verbergen)'!C:M,11,0),\"NVT\")","v":15.804630964856232},{"$f":"IFERROR(VLOOKUP(A7,'Data CAO GGZ 2019 (verbergen)'!C:M,11,0),\"NVT\")","v":16.485929712460063},null,30,{"$f":"AVERAGE(B50:B61)/$G$1","v":20.504609291799788},19.715320778390943,20.182145803078708,null,30,{"$f":"G7/$L$1","v":33.835988930362689},32.533532637608815,33.303870962176084,null,30,{"$f":"G7/$Q$1","v":33.178979436569236},31.901813557266898,32.657193856114411,null,30,{"$f":"G7/$V$1","v":43.258669391982679},41.593503751879631,42.578366673161831]
["10/5",{"$f":"IFERROR(VLOOKUP(A8,'Data CAO GHZ 2019 (verbergen)'!C:K,9,0),\"NVT\")","v":16.64586661341853},null,{"$f":"IFERROR(VLOOKUP(A8,'Data CAO GGZ 2019 (verbergen)'!C:M,11,0),\"NVT\")","v":16.910338658146962},null,35,{"$f":"AVERAGE(B62:B73)/$G$1","v":21.686260316826417},21.204584089456869,21.349913447574785,null,35,{"$f":"G8/$L$1","v":35.785908113574948},34.991062853889225,35.230880276526051,null,35,{"$f":"G8/$Q$1","v":35.091036111369604},34.311624740221468,34.546785513875058,null,35,{"$f":"G8/$V$1","v":45.75160404393759},44.735409471428,45.04201149277381]
["10/6",{"$f":"IFERROR(VLOOKUP(A9,'Data CAO GHZ 2019 (verbergen)'!C:K,9,0),\"NVT\")","v":17.072683706070286},null,{"$f":"IFERROR(VLOOKUP(A9,'Data CAO GGZ 2019 (verbergen)'!C:M,11,0),\"NVT\")","v":17.381904153354633},null,40,{"$f":"AVERAGE(B74:B86)/$G$1","v":22.897946618743347},23.191915543421434,23.180708773654455,null,40,{"$f":"G9/$L$1","v":37.785390459972518},38.270487695414907,38.251994675997452,null,40,{"$f":"G9/$Q$1","v":37.051693557837133},37.527371429484518,37.509237497822745,null,40,{"$f":"G9/$V$1","v":48.307904258952213},48.928091863758304,48.90444888956636]
["10/7",{"$f":"IFERROR(VLOOKUP(A10,'Data CAO GHZ 2019 (verbergen)'!C:K,9,0),\"NVT\")","v":17.508985623003195},null,{"$f":"IFERROR(VLOOKUP(A10,'Data CAO GGZ 2019 (verbergen)'!C:M,11,0),\"NVT\")","v":17.910057507987222},null,45,{"$f":"AVERAGE(B87:B99)/$G$1","v":24.937062238879335},26.497877627263044,25.645182600147454,null,45,{"$f":"G10/$L$1","v":41.150267720922997},43.725870672051229,42.318783168560152,null,45,{"$f":"G10/$Q$1","v":40.351233396244879},42.876824639584214,41.497059223539573,null,45,{"$f":"G10/$V$1","v":52.609835947002821},55.902695416166765,54.103760759804757]
["10/8",{"$f":"IFERROR(VLOOKUP(A11,'Data CAO GHZ 2019 (verbergen)'!C:K,9,0),\"NVT\")","v":18.002196485623003},null,{"$f":"IFERROR(VLOOKUP(A11,'Data CAO GGZ 2019 (verbergen)'!C:M,11,0),\"NVT\")","v":18.466504792332266},null,50,{"$f":"AVERAGE(B100:B112)/$G$1","v":28.553698697468665},29.394133624164979,28.916396166134188,null,50,{"$f":"G11/$L$1","v":47.118314682291526},48.505170996971913,47.716825356657075,null,50,{"$f":"G11/$Q$1","v":46.203395950596544},47.563323016448187,46.790285058469557,null,50,{"$f":"G11/$V$1","v":60.239870669765118},62.012940135369156,61.005055202814745]
["10/9",{"$f":"IFERROR(VLOOKUP(A12,'Data CAO GHZ 2019 (verbergen)'!C:K,9,0),\"NVT\")","v":18.552316293929714},null,null,null,55,{"$f":"AVERAGE(B113:B125)/$G$1","v":32.24329534283607},32.487262367412143,32.549808306709274,null,55,{"$f":"G12/$L$1","v":53.206757991478668},53.609343840614102,53.712554961566461,null,55,{"$f":"G12/$Q$1","v":52.173617059605292},52.568385707786639,52.669592729303034,null,55,{"$f":"G12/$V$1","v":68.023829837206904},68.538528201291442,68.670481659724203]
["10/10",{"$f":"IFERROR(VLOOKUP(A13,'Data CAO GHZ 2019 (verbergen)'!C:K,9,0),\"NVT\")","v":19.121405750798726},null,null,null,60,{"$f":"AVERAGE(B126:B138)/$G$1","v":36.866782378962895},37.755454533836769,36.705800755155387,null,60,{"$f":"G13/$L$1","v":60.836274552744051},62.302730253856055,60.570628308837271,null,60,{"$f":"G13/$Q$1","v":59.654987668224749},61.092968501353994,59.394499603811305,null,60,{"$f":"G13/$V$1","v":77.778021896546193},79.652857666322305,77.438398217627409]
["15/0",{"$f":"IFERROR(VLOOKUP(A14,'Data CAO GHZ 2019 (verbergen)'!C:K,9,0),\"NVT\")","v":14.758386581469649},{"$f":"IFERROR(VLOOKUP(A14,'Data CAO VVT 2019 (verbergen)'!C:M,11,0),\"NVT\")","v":15.804630964856232},{"$f":"IFERROR(VLOOKUP(A14,'Data CAO GGZ 2019 (verbergen)'!C:M,11,0),\"NVT\")","v":15.363603833865815},null,65,{"$f":"AVERAGE(B139:B154)/$G$1","v":43.322251064962721},42.993221681309905,43.022008355861388,null,65,{"$f":"G14/$L$1","v":71.48886314350284},70.945910365197861,70.993413128484136,null,65,{"$f":"G14/$Q$1","v":70.100729878580452},69.568319872669747,69.614900252202901,null,65,{"$f":"G14/$V$1","v":91.397154145490973},90.702999327658034,90.763730708568332]
["15/1",{"$f":"IFERROR(VLOOKUP(A15,'Data CAO GHZ 2019 (verbergen)'!C:K,9,0),\"NVT\")","v":15.327476038338656},{"$f":"IFERROR(VLOOKUP(A15,'Data CAO VVT 2019 (verbergen)'!C:M,11,0),\"NVT\")","v":16.108601201277953},{"$f":"IFERROR(VLOOKUP(A15,'Data CAO GGZ 2019 (verbergen)'!C:M,11,0),\"NVT\")","v":15.655974440894568},null,70,{"$f":"AVERAGE(B155:B170)/$G$1","v":51.961661341853038},51.314712455271568,51.595069058736797,null,70,{"$f":"G15/$L$1","v":85.745315745632084},84.677743325530642,85.140377984714192,null,70,{"$f":"G15/$Q$1","v":84.080358158338257},83.033515299792185,83.487166761710029,null,70,{"$f":"G15/$V$1","v":109.62375810517518},108.25888703643791,108.85035666400169]
["15/2",{"$f":"IFERROR(VLOOKUP(A16,'Data CAO GHZ 2019 (verbergen)'!C:K,9,0),\"NVT\")","v":15.896565495207664},{"$f":"IFERROR(VLOOKUP(A16,'Data CAO VVT 2019 (verbergen)'!C:M,11,0),\"NVT\")","v":16.533641891373801},{"$f":"IFERROR(VLOOKUP(A16,'Data CAO GGZ 2019 (verbergen)'!C:M,11,0),\"NVT\")","v":16.070952076677315},null,75,{"$f":"AVERAGE(B171:B189)/$G$1","v":62.409585839127992},60.822118960147975,61.808403833865825,null,75,{"$f":"G16/$L$1","v":102.9861152460858},100.36653293753791,101.99406573245186,null,75,{"$f":"G16/$Q$1","v":100.98638485295791},98.417668220304165,100.01359843667609,null,75,{"$f":"G16/$V$1","v":131.66579290955272},128.31670666697886,130.39747644275491]
["15/3",{"$f":"IFERROR(VLOOKUP(A17,'Data CAO GHZ 2019 (verbergen)'!C:K,9,0),\"NVT\")","v":16.190595047923324},{"$f":"IFERROR(VLOOKUP(A17,'Data CAO VVT 2019 (verbergen)'!C:M,11,0),\"NVT\")","v":16.946700153354634},{"$f":"IFERROR(VLOOKUP(A17,'Data CAO GGZ 2019 (verbergen)'!C:M,11,0),\"NVT\")","v":16.485929712460063},null,80,{"$f":"AVERAGE(B190:B208)/$G$1","v":73.374042708137566},71.533632729107126,72.688991693290731,null,80,{"$f":"G17/$L$1","v":121.07927839626662},118.04229823285004,119.94883117704741,null,80,{"$f":"G17/$Q$1","v":118.72822444682454},115.750214772018,117.61972765904649,null,80,{"$f":"G17/$V$1","v":154.79755845598643},150.91483698123866,153.35230315040241]
["15/4",{"$f":"IFERROR(VLOOKUP(A18,'Data CAO GHZ 2019 (verbergen)'!C:K,9,0),\"NVT\")","v":16.64586661341853},{"$f":"IFERROR(VLOOKUP(A18,'Data CAO VVT 2019 (verbergen)'!C:M,11,0),\"NVT\")","v":17.396184996805115},{"$f":"IFERROR(VLOOKUP(A18,'Data CAO GGZ 2019 (verbergen)'!C:M,11,0),\"NVT\")","v":16.910338658146962}]
["15/5",{"$f":"IFERROR(VLOOKUP(A19,'Data CAO GHZ 2019 (verbergen)'!C:K,9,0),\"NVT\")","v":17.072683706070286},{"$f":"IFERROR(VLOOKUP(A19,'Data CAO VVT 2019 (verbergen)'!C:M,11,0),\"NVT\")","v":17.88209642172524},{"$f":"IFERROR(VLOOKUP(A19,'Data CAO GGZ 2019 (verbergen)'!C:M,11,0),\"NVT\")","v":17.381904153354633}]
["15/6",{"$f":"IFERROR(VLOOKUP(A20,'Data CAO GHZ 2019 (verbergen)'!C:K,9,0),\"NVT\")","v":17.508985623003195},{"$f":"IFERROR(VLOOKUP(A20,'Data CAO VVT 2019 (verbergen)'!C:M,11,0),\"NVT\")","v":18.428686862619809},{"$f":"IFERROR(VLOOKUP(A20,'Data CAO GGZ 2019 (verbergen)'!C:M,11,0),\"NVT\")","v":17.910057507987222}]
["15/7",{"$f":"IFERROR(VLOOKUP(A21,'Data CAO GHZ 2019 (verbergen)'!C:K,9,0),\"NVT\")","v":18.002196485623003},{"$f":"IFERROR(VLOOKUP(A21,'Data CAO VVT 2019 (verbergen)'!C:M,11,0),\"NVT\")","v":18.999625597444091},{"$f":"IFERROR(VLOOKUP(A21,'Data CAO GGZ 2019 (verbergen)'!C:M,11,0),\"NVT\")","v":18.466504792332266}]
["15/8",{"$f":"IFERROR(VLOOKUP(A22,'Data CAO GHZ 2019 (verbergen)'!C:K,9,0),\"NVT\")","v":18.552316293929714},{"$f":"IFERROR(VLOOKUP(A22,'Data CAO VVT 2019 (verbergen)'!C:M,11,0),\"NVT\")","v":19.643609214057513},{"$f":"IFERROR(VLOOKUP(A22,'Data CAO GGZ 2019 (verbergen)'!C:M,11,0),\"NVT\")","v":19.088971246006391}]
["15/9",{"$f":"IFERROR(VLOOKUP(A23,'Data CAO GHZ 2019 (verbergen)'!C:K,9,0),\"NVT\")","v":19.121405750798726},null,{"$f":"IFERROR(VLOOKUP(A23,'Data CAO GGZ 2019 (verbergen)'!C:M,11,0),\"NVT\")","v":19.720869009584668}]
["15/10",{"$f":"IFERROR(VLOOKUP(A24,'Data CAO GHZ 2019 (verbergen)'!C:K,9,0),\"NVT\")","v":19.756888977635779}]
["15/11",{"$f":"IFERROR(VLOOKUP(A25,'Data CAO GHZ 2019 (verbergen)'!C:K,9,0),\"NVT\")","v":20.420826677316295}]
["20/0",{"$f":"IFERROR(VLOOKUP(A26,'Data CAO GHZ 2019 (verbergen)'!C:K,9,0),\"NVT\")","v":15.327476038338656},{"$f":"IFERROR(VLOOKUP(A26,'Data CAO VVT 2019 (verbergen)'!C:M,11,0),\"NVT\")","v":16.533641891373801},{"$f":"IFERROR(VLOOKUP(A26,'Data CAO GGZ 2019 (verbergen)'!C:M,11,0),\"NVT\")","v":15.655974440894568}]
["20/1",{"$f":"IFERROR(VLOOKUP(A27,'Data CAO GHZ 2019 (verbergen)'!C:K,9,0),\"NVT\")","v":16.190595047923324},{"$f":"IFERROR(VLOOKUP(A27,'Data CAO VVT 2019 (verbergen)'!C:M,11,0),\"NVT\")","v":16.946700153354634},{"$f":"IFERROR(VLOOKUP(A27,'Data CAO GGZ 2019 (verbergen)'!C:M,11,0),\"NVT\")","v":16.070952076677315}]
["20/2",{"$f":"IFERROR(VLOOKUP(A28,'Data CAO GHZ 2019 (verbergen)'!C:K,9,0),\"NVT\")","v":16.64586661341853},{"$f":"IFERROR(VLOOKUP(A28,'Data CAO VVT 2019 (verbergen)'!C:M,11,0),\"NVT\")","v":17.396184996805115},{"$f":"IFERROR(VLOOKUP(A28,'Data CAO GGZ 2019 (verbergen)'!C:M,11,0),\"NVT\")","v":16.485929712460063}]
["20/3",{"$f":"IFERROR(VLOOKUP(A29,'Data CAO GHZ 2019 (verbergen)'!C:K,9,0),\"NVT\")","v":17.072683706070286},{"$f":"IFERROR(VLOOKUP(A29,'Data CAO VVT 2019 (verbergen)'!C:M,11,0),\"NVT\")","v":17.88209642172524},{"$f":"IFERROR(VLOOKUP(A29,'Data CAO GGZ 2019 (verbergen)'!C:M,11,0),\"NVT\")","v":16.910338658146962}]
["20/4",{"$f":"IFERROR(VLOOKUP(A30,'Data CAO GHZ 2019 (verbergen)'!C:K,9,0),\"NVT\")","v":17.508985623003195},{"$f":"IFERROR(VLOOKUP(A30,'Data CAO VVT 2019 (verbergen)'!C:M,11,0),\"NVT\")","v":18.428686862619809},{"$f":"IFERROR(VLOOKUP(A30,'Data CAO GGZ 2019 (verbergen)'!C:M,11,0),\"NVT\")","v":17.381904153354633}]
["20/5",{"$f":"IFERROR(VLOOKUP(A31,'Data CAO GHZ 2019 (verbergen)'!C:K,9,0),\"NVT\")","v":18.002196485623003},{"$f":"IFERROR(VLOOKUP(A31,'Data CAO VVT 2019 (verbergen)'!C:M,11,0),\"NVT\")","v":18.999625597444091},{"$f":"IFERROR(VLOOKUP(A31,'Data CAO GGZ 2019 (verbergen)'!C:M,11,0),\"NVT\")","v":17.910057507987222}]
["20/6",{"$f":"IFERROR(VLOOKUP(A32,'Data CAO GHZ 2019 (verbergen)'!C:K,9,0),\"NVT\")","v":18.552316293929714},{"$f":"IFERROR(VLOOKUP(A32,'Data CAO VVT 2019 (verbergen)'!C:M,11,0),\"NVT\")","v":19.643609214057513},{"$f":"IFERROR(VLOOKUP(A32,'Data CAO GGZ 2019 (verbergen)'!C:M,11,0),\"NVT\")","v":18.466504792332266}]
["20/7",{"$f":"IFERROR(VLOOKUP(A33,'Data CAO GHZ 2019 (verbergen)'!C:K,9,0),\"NVT\")","v":19.121405750798726},{"$f":"IFERROR(VLOOKUP(A33,'Data CAO VVT 2019 (verbergen)'!C:M,11,0),\"NVT\")","v":20.28730525239617},{"$f":"IFERROR(VLOOKUP(A33,'Data CAO GGZ 2019 (verbergen)'!C:M,11,0),\"NVT\")","v":19.088971246006391}]
["20/8",{"$f":"IFERROR(VLOOKUP(A34,'Data CAO GHZ 2019 (verbergen)'!C:K,9,0),\"NVT\")","v":19.756888977635779},{"$f":"IFERROR(VLOOKUP(A34,'Data CAO VVT 2019 (verbergen)'!C:M,11,0),\"NVT\")","v":20.882879859424918},{"$f":"IFERROR(VLOOKUP(A34,'Data CAO GGZ 2019 (verbergen)'!C:M,11,0),\"NVT\")","v":19.720869009584668}]
["20/9",{"$f":"IFERROR(VLOOKUP(A35,'Data CAO GHZ 2019 (verbergen)'!C:K,9,0),\"NVT\")","v":20.420826677316295},null,{"$f":"IFERROR(VLOOKUP(A35,'Data CAO GGZ 2019 (verbergen)'!C:M,11,0),\"NVT\")","v":20.296178913738014}]
["20/10",{"$f":"IFERROR(VLOOKUP(A36,'Data CAO GHZ 2019 (verbergen)'!C:K,9,0),\"NVT\")","v":21.018370607028757},null,{"$f":"IFERROR(VLOOKUP(A36,'Data CAO GGZ 2019 (verbergen)'!C:M,11,0),\"NVT\")","v":20.956370607028756}]
["20/11",{"$f":"IFERROR(VLOOKUP(A37,'Data CAO GHZ 2019 (verbergen)'!C:K,9,0),\"NVT\")","v":21.691793130990416}]
["25/0",{"$f":"IFERROR(VLOOKUP(A38,'Data CAO GHZ 2019 (verbergen)'!C:K,9,0),\"NVT\")","v":15.896565495207664},{"$f":"IFERROR(VLOOKUP(A38,'Data CAO VVT 2019 (verbergen)'!C:M,11,0),\"NVT\")","v":16.946700153354634},{"$f":"IFERROR(VLOOKUP(A38,'Data CAO GGZ 2019 (verbergen)'!C:M,11,0),\"NVT\")","v":16.070952076677315}]
["25/1",{"$f":"IFERROR(VLOOKUP(A39,'Data CAO GHZ 2019 (verbergen)'!C:K,9,0),\"NVT\")","v":16.64586661341853},{"$f":"IFERROR(VLOOKUP(A39,'Data CAO VVT 2019 (verbergen)'!C:M,11,0),\"NVT\")","v":17.396184996805115},{"$f":"IFERROR(VLOOKUP(A39,'Data CAO GGZ 2019 (verbergen)'!C:M,11,0),\"NVT\")","v":16.910338658146962}]
["25/2",{"$f":"IFERROR(VLOOKUP(A40,'Data CAO GHZ 2019 (verbergen)'!C:K,9,0),\"NVT\")","v":17.508985623003195},{"$f":"IFERROR(VLOOKUP(A40,'Data CAO VVT 2019 (verbergen)'!C:M,11,0),\"NVT\")","v":17.88209642172524},{"$f":"IFERROR(VLOOKUP(A40,'Data CAO GGZ 2019 (verbergen)'!C:M,11,0),\"NVT\")","v":17.381904153354633}]
["25/3",{"$f":"IFERROR(VLOOKUP(A41,'Data CAO GHZ 2019 (verbergen)'!C:K,9,0),\"NVT\")","v":18.002196485623003},{"$f":"IFERROR(VLOOKUP(A41,'Data CAO VVT 2019 (verbergen)'!C:M,11,0),\"NVT\")","v":18.428686862619809},{"$f":"IFERROR(VLOOKUP(A41,'Data CAO GGZ 2019 (verbergen)'!C:M,11,0),\"NVT\")","v":17.910057507987222}]
["25/4",{"$f":"IFERROR(VLOOKUP(A42,'Data CAO GHZ 2019 (verbergen)'!C:K,9,0),\"NVT\")","v":18.552316293929714},{"$f":"IFERROR(VLOOKUP(A42,'Data CAO VVT 2019 (verbergen)'!C:M,11,0),\"NVT\")","v":18.999625597444091},{"$f":"IFERROR(VLOOKUP(A42,'Data CAO GGZ 2019 (verbergen)'!C:M,11,0),\"NVT\")","v":18.466504792332266}]
["25/5",{"$f":"IFERROR(VLOOKUP(A43,'Data CAO GHZ 2019 (verbergen)'!C:K,9,0),\"NVT\")","v":19.121405750798726},{"$f":"IFERROR(VLOOKUP(A43,'Data CAO VVT 2019 (verbergen)'!C:M,11,0),\"NVT\")","v":19.643609214057513},{"$f":"IFERROR(VLOOKUP(A43,'Data CAO GGZ 2019 (verbergen)'!C:M,11,0),\"NVT\")","v":19.088971246006391}]
["25/6",{"$f":"IFERROR(VLOOKUP(A44,'Data CAO GHZ 2019 (verbergen)'!C:K,9,0),\"NVT\")","v":19.756888977635779},{"$f":"IFERROR(VLOOKUP(A44,'Data CAO VVT 2019 (verbergen)'!C:M,11,0),\"NVT\")","v":20.28730525239617},{"$f":"IFERROR(VLOOKUP(A44,'Data CAO GGZ 2019 (verbergen)'!C:M,11,0),\"NVT\")","v":19.720869009584668}]
["25/7",{"$f":"IFERROR(VLOOKUP(A45,'Data CAO GHZ 2019 (verbergen)'!C:K,9,0),\"NVT\")","v":20.420826677316295},{"$f":"IFERROR(VLOOKUP(A45,'Data CAO VVT 2019 (verbergen)'!C:M,11,0),\"NVT\")","v":20.882879859424918},{"$f":"IFERROR(VLOOKUP(A45,'Data CAO GGZ 2019 (verbergen)'!C:M,11,0),\"NVT\")","v":20.296178913738014}]
["25/8",{"$f":"IFERROR(VLOOKUP(A46,'Data CAO GHZ 2019 (verbergen)'!C:K,9,0),\"NVT\")","v":21.018370607028757},{"$f":"IFERROR(VLOOKUP(A46,'Data CAO VVT 2019 (verbergen)'!C:M,11,0),\"NVT\")","v":21.550636613418533},{"$f":"IFERROR(VLOOKUP(A46,'Data CAO GGZ 2019 (verbergen)'!C:M,11,0),\"NVT\")","v":20.956370607028756}]
["25/9",{"$f":"IFERROR(VLOOKUP(A47,'Data CAO GHZ 2019 (verbergen)'!C:K,9,0),\"NVT\")","v":21.691793130990416},{"$f":"IFERROR(VLOOKUP(A47,'Data CAO VVT 2019 (verbergen)'!C:M,11,0),\"NVT\")","v":22.097322913738015},{"$f":"IFERROR(VLOOKUP(A47,'Data CAO GGZ 2019 (verbergen)'!C:M,11,0),\"NVT\")","v":21.484523961661342}]
["25/10",{"$f":"IFERROR(VLOOKUP(A48,'Data CAO GHZ 2019 (verbergen)'!C:K,9,0),\"NVT\")","v":22.241912939297123},null,{"$f":"IFERROR(VLOOKUP(A48,'Data CAO GGZ 2019 (verbergen)'!C:M,11,0),\"NVT\")","v":22.116421725239611}]
["25/11",{"$f":"IFERROR(VLOOKUP(A49,'Data CAO GHZ 2019 (verbergen)'!C:K,9,0),\"NVT\")","v":22.886880990415335}]
["30/0",{"$f":"IFERROR(VLOOKUP(A50,'Data CAO GHZ 2019 (verbergen)'!C:K,9,0),\"NVT\")","v":16.190595047923324},{"$f":"IFERROR(VLOOKUP(A50,'Data CAO VVT 2019 (verbergen)'!C:M,11,0),\"NVT\")","v":16.946700153354634},{"$f":"IFERROR(VLOOKUP(A50,'Data CAO GGZ 2019 (verbergen)'!C:M,11,0),\"NVT\")","v":16.485929712460063}]
["30/1",{"$f":"IFERROR(VLOOKUP(A51,'Data CAO GHZ 2019 (verbergen)'!C:K,9,0),\"NVT\")","v":17.072683706070286},{"$f":"IFERROR(VLOOKUP(A51,'Data CAO VVT 2019 (verbergen)'!C:M,11,0),\"NVT\")","v":17.396184996805115},{"$f":"IFERROR(VLOOKUP(A51,'Data CAO GGZ 2019 (verbergen)'!C:M,11,0),\"NVT\")","v":17.381904153354633}]
["30/2",{"$f":"IFERROR(VLOOKUP(A52,'Data CAO GHZ 2019 (verbergen)'!C:K,9,0),\"NVT\")","v":18.002196485623003},{"$f":"IFERROR(VLOOKUP(A52,'Data CAO VVT 2019 (verbergen)'!C:M,11,0),\"NVT\")","v":17.88209642172524},{"$f":"IFERROR(VLOOKUP(A52,'Data CAO GGZ 2019 (verbergen)'!C:M,11,0),\"NVT\")","v":18.466504792332266}]
["30/3",{"$f":"IFERROR(VLOOKUP(A53,'Data CAO GHZ 2019 (verbergen)'!C:K,9,0),\"NVT\")","v":19.121405750798726},{"$f":"IFERROR(VLOOKUP(A53,'Data CAO VVT 2019 (verbergen)'!C:M,11,0),\"NVT\")","v":18.428686862619809},{"$f":"IFERROR(VLOOKUP(A53,'Data CAO GGZ 2019 (verbergen)'!C:M,11,0),\"NVT\")","v":19.088971246006391}]
["30/4",{"$f":"IFERROR(VLOOKUP(A54,'Data CAO GHZ 2019 (verbergen)'!C:K,9,0),\"NVT\")","v":19.756888977635779},{"$f":"IFERROR(VLOOKUP(A54,'Data CAO VVT 2019 (verbergen)'!C:M,11,0),\"NVT\")","v":18.999625597444091},{"$f":"IFERROR(VLOOKUP(A54,'Data CAO GGZ 2019 (verbergen)'!C:M,11,0),\"NVT\")","v":19.720869009584668}]
["30/5",{"$f":"IFERROR(VLOOKUP(A55,'Data CAO GHZ 2019 (verbergen)'!C:K,9,0),\"NVT\")","v":20.420826677316295},{"$f":"IFERROR(VLOOKUP(A55,'Data CAO VVT 2019 (verbergen)'!C:M,11,0),\"NVT\")","v":19.643609214057513},{"$f":"IFERROR(VLOOKUP(A55,'Data CAO GGZ 2019 (verbergen)'!C:M,11,0),\"NVT\")","v":20.296178913738014}]
["30/6",{"$f":"IFERROR(VLOOKUP(A56,'Data CAO GHZ 2019 (verbergen)'!C:K,9,0),\"NVT\")","v":21.018370607028757},{"$f":"IFERROR(VLOOKUP(A56,'Data CAO VVT 2019 (verbergen)'!C:M,11,0),\"NVT\")","v":20.28730525239617},{"$f":"IFERROR(VLOOKUP(A56,'Data CAO GGZ 2019 (verbergen)'!C:M,11,0),\"NVT\")","v":20.956370607028756}]
["30/7",{"$f":"IFERROR(VLOOKUP(A57,'Data CAO GHZ 2019 (verbergen)'!C:K,9,0),\"NVT\")","v":21.691793130990416},{"$f":"IFERROR(VLOOKUP(A57,'Data CAO VVT 2019 (verbergen)'!C:M,11,0),\"NVT\")","v":20.882879859424918},{"$f":"IFERROR(VLOOKUP(A57,'Data CAO GGZ 2019 (verbergen)'!C:M,11,0),\"NVT\")","v":21.484523961661342}]
["30/8",{"$f":"IFERROR(VLOOKUP(A58,'Data CAO GHZ 2019 (verbergen)'!C:K,9,0),\"NVT\")","v":22.241912939297123},{"$f":"IFERROR(VLOOKUP(A58,'Data CAO VVT 2019 (verbergen)'!C:M,11,0),\"NVT\")","v":21.550636613418533},{"$f":"IFERROR(VLOOKUP(A58,'Data CAO GGZ 2019 (verbergen)'!C:M,11,0),\"NVT\")","v":22.116421725239611}]
["30/9",{"$f":"IFERROR(VLOOKUP(A59,'Data CAO GHZ 2019 (verbergen)'!C:K,9,0),\"NVT\")","v":22.886880990415335},{"$f":"IFERROR(VLOOKUP(A59,'Data CAO VVT 2019 (verbergen)'!C:M,11,0),\"NVT\")","v":22.097322913738015},{"$f":"IFERROR(VLOOKUP(A59,'Data CAO GGZ 2019 (verbergen)'!C:M,11,0),\"NVT\")","v":22.701162939297124}]
["30/10",{"$f":"IFERROR(VLOOKUP(A60,'Data CAO GHZ 2019 (verbergen)'!C:K,9,0),\"NVT\")","v":23.503394568690098},{"$f":"IFERROR(VLOOKUP(A60,'Data CAO VVT 2019 (verbergen)'!C:M,11,0),\"NVT\")","v":22.753480677316293},{"$f":"IFERROR(VLOOKUP(A60,'Data CAO GGZ 2019 (verbergen)'!C:M,11,0),\"NVT\")","v":23.304766773162935}]
["30/11",{"$f":"IFERROR(VLOOKUP(A61,'Data CAO GHZ 2019 (verbergen)'!C:K,9,0),\"NVT\")","v":24.148362619808307}]
["35/0",{"$f":"IFERROR(VLOOKUP(A62,'Data CAO GHZ 2019 (verbergen)'!C:K,9,0),\"NVT\")","v":17.072683706070286},{"$f":"IFERROR(VLOOKUP(A62,'Data CAO VVT 2019 (verbergen)'!C:M,11,0),\"NVT\")","v":17.88209642172524},{"$f":"IFERROR(VLOOKUP(A62,'Data CAO GGZ 2019 (verbergen)'!C:M,11,0),\"NVT\")","v":17.381904153354633}]
["35/1",{"$f":"IFERROR(VLOOKUP(A63,'Data CAO GHZ 2019 (verbergen)'!C:K,9,0),\"NVT\")","v":18.002196485623003},{"$f":"IFERROR(VLOOKUP(A63,'Data CAO VVT 2019 (verbergen)'!C:M,11,0),\"NVT\")","v":18.428686862619809},{"$f":"IFERROR(VLOOKUP(A63,'Data CAO GGZ 2019 (verbergen)'!C:M,11,0),\"NVT\")","v":18.466504792332266}]
["35/2",{"$f":"IFERROR(VLOOKUP(A64,'Data CAO GHZ 2019 (verbergen)'!C:K,9,0),\"NVT\")","v":19.121405750798726},{"$f":"IFERROR(VLOOKUP(A64,'Data CAO VVT 2019 (verbergen)'!C:M,11,0),\"NVT\")","v":18.999625597444091},{"$f":"IFERROR(VLOOKUP(A64,'Data CAO GGZ 2019 (verbergen)'!C:M,11,0),\"NVT\")","v":19.720869009584668}]
["35/3",{"$f":"IFERROR(VLOOKUP(A65,'Data CAO GHZ 2019 (verbergen)'!C:K,9,0),\"NVT\")","v":20.420826677316295},{"$f":"IFERROR(VLOOKUP(A65,'Data CAO VVT 2019 (verbergen)'!C:M,11,0),\"NVT\")","v":19.643609214057513},{"$f":"IFERROR(VLOOKUP(A65,'Data CAO GGZ 2019 (verbergen)'!C:M,11,0),\"NVT\")","v":20.296178913738014}]
["35/4",{"$f":"IFERROR(VLOOKUP(A66,'Data CAO GHZ 2019 (verbergen)'!C:K,9,0),\"NVT\")","v":21.018370607028757},{"$f":"IFERROR(VLOOKUP(A66,'Data CAO VVT 2019 (verbergen)'!C:M,11,0),\"NVT\")","v":20.28730525239617},{"$f":"IFERROR(VLOOKUP(A66,'Data CAO GGZ 2019 (verbergen)'!C:M,11,0),\"NVT\")","v":20.956370607028756}]
["35/5",{"$f":"IFERROR(VLOOKUP(A67,'Data CAO GHZ 2019 (verbergen)'!C:K,9,0),\"NVT\")","v":21.691793130990416},{"$f":"IFERROR(VLOOKUP(A67,'Data CAO VVT 2019 (verbergen)'!C:M,11,0),\"NVT\")","v":20.882879859424918},{"$f":"IFERROR(VLOOKUP(A67,'Data CAO GGZ 2019 (verbergen)'!C:M,11,0),\"NVT\")","v":21.484523961661342}]
["35/6",{"$f":"IFERROR(VLOOKUP(A68,'Data CAO GHZ 2019 (verbergen)'!C:K,9,0),\"NVT\")","v":22.241912939297123},{"$f":"IFERROR(VLOOKUP(A68,'Data CAO VVT 2019 (verbergen)'!C:M,11,0),\"NVT\")","v":21.550636613418533},{"$f":"IFERROR(VLOOKUP(A68,'Data CAO GGZ 2019 (verbergen)'!C:M,11,0),\"NVT\")","v":22.116421725239611}]
["35/7",{"$f":"IFERROR(VLOOKUP(A69,'Data CAO GHZ 2019 (verbergen)'!C:K,9,0),\"NVT\")","v":22.886880990415335},{"$f":"IFERROR(VLOOKUP(A69,'Data CAO VVT 2019 (verbergen)'!C:M,11,0),\"NVT\")","v":22.097322913738015},{"$f":"IFERROR(VLOOKUP(A69,'Data CAO GGZ 2019 (verbergen)'!C:M,11,0),\"NVT\")","v":22.701162939297124}]
["35/8",{"$f":"IFERROR(VLOOKUP(A70,'Data CAO GHZ 2019 (verbergen)'!C:K,9,0),\"NVT\")","v":23.503394568690098},{"$f":"IFERROR(VLOOKUP(A70,'Data CAO VVT 2019 (verbergen)'!C:M,11,0),\"NVT\")","v":22.753480677316293},{"$f":"IFERROR(VLOOKUP(A70,'Data CAO GGZ 2019 (verbergen)'!C:M,11,0),\"NVT\")","v":23.304766773162935}]
["35/9",{"$f":"IFERROR(VLOOKUP(A71,'Data CAO GHZ 2019 (verbergen)'!C:K,9,0),\"NVT\")","v":24.148362619808307},{"$f":"IFERROR(VLOOKUP(A71,'Data CAO VVT 2019 (verbergen)'!C:M,11,0),\"NVT\")","v":23.348671846645367},{"$f":"IFERROR(VLOOKUP(A71,'Data CAO GGZ 2019 (verbergen)'!C:M,11,0),\"NVT\")","v":23.908370607028758}]
["35/10",{"$f":"IFERROR(VLOOKUP(A72,'Data CAO GHZ 2019 (verbergen)'!C:K,9,0),\"NVT\")","v":24.75539137380192},{"$f":"IFERROR(VLOOKUP(A72,'Data CAO VVT 2019 (verbergen)'!C:M,11,0),\"NVT\")","v":23.980481316293929},{"$f":"IFERROR(VLOOKUP(A72,'Data CAO GGZ 2019 (verbergen)'!C:M,11,0),\"NVT\")","v":24.511974440894569}]
["35/11",{"$f":"IFERROR(VLOOKUP(A73,'Data CAO GHZ 2019 (verbergen)'!C:K,9,0),\"NVT\")","v":25.371904952076676},{"$f":"IFERROR(VLOOKUP(A73,'Data CAO VVT 2019 (verbergen)'!C:M,11,0),\"NVT\")","v":24.600212498402559}]
["40/0",{"$f":"IFERROR(VLOOKUP(A74,'Data CAO GHZ 2019 (verbergen)'!C:K,9,0),\"NVT\")","v":18.002196485623003},{"$f":"IFERROR(VLOOKUP(A74,'Data CAO VVT 2019 (verbergen)'!C:M,11,0),\"NVT\")","v":18.999625597444091},{"$f":"IFERROR(VLOOKUP(A74,'Data CAO GGZ 2019 (verbergen)'!C:M,11,0),\"NVT\")","v":18.466504792332266}]
["40/1",{"$f":"IFERROR(VLOOKUP(A75,'Data CAO GHZ 2019 (verbergen)'!C:K,9,0),\"NVT\")","v":19.121405750798726},{"$f":"IFERROR(VLOOKUP(A75,'Data CAO VVT 2019 (verbergen)'!C:M,11,0),\"NVT\")","v":20.28730525239617},{"$f":"IFERROR(VLOOKUP(A75,'Data CAO GGZ 2019 (verbergen)'!C:M,11,0),\"NVT\")","v":19.720869009584668}]
["40/2",{"$f":"IFERROR(VLOOKUP(A76,'Data CAO GHZ 2019 (verbergen)'!C:K,9,0),\"NVT\")","v":20.420826677316295},{"$f":"IFERROR(VLOOKUP(A76,'Data CAO VVT 2019 (verbergen)'!C:M,11,0),\"NVT\")","v":21.550636613418533},{"$f":"IFERROR(VLOOKUP(A76,'Data CAO GGZ 2019 (verbergen)'!C:M,11,0),\"NVT\")","v":20.956370607028756}]
["40/3",{"$f":"IFERROR(VLOOKUP(A77,'Data CAO GHZ 2019 (verbergen)'!C:K,9,0),\"NVT\")","v":21.691793130990416},{"$f":"IFERROR(VLOOKUP(A77,'Data CAO VVT 2019 (verbergen)'!C:M,11,0),\"NVT\")","v":22.097322913738015},{"$f":"IFERROR(VLOOKUP(A77,'Data CAO GGZ 2019 (verbergen)'!C:M,11,0),\"NVT\")","v":21.484523961661342}]
["40/4",{"$f":"IFERROR(VLOOKUP(A78,'Data CAO GHZ 2019 (verbergen)'!C:K,9,0),\"NVT\")","v":22.241912939297123},{"$f":"IFERROR(VLOOKUP(A78,'Data CAO VVT 2019 (verbergen)'!C:M,11,0),\"NVT\")","v":22.753480677316293},{"$f":"IFERROR(VLOOKUP(A78,'Data CAO GGZ 2019 (verbergen)'!C:M,11,0),\"NVT\")","v":22.116421725239611}]
["40/5",{"$f":"IFERROR(VLOOKUP(A79,'Data CAO GHZ 2019 (verbergen)'!C:K,9,0),\"NVT\")","v":22.886880990415335},{"$f":"IFERROR(VLOOKUP(A79,'Data CAO VVT 2019 (verbergen)'!C:M,11,0),\"NVT\")","v":23.348671846645367},{"$f":"IFERROR(VLOOKUP(A79,'Data CAO GGZ 2019 (verbergen)'!C:M,11,0),\"NVT\")","v":22.701162939297124}]
["40/6",{"$f":"IFERROR(VLOOKUP(A80,'Data CAO GHZ 2019 (verbergen)'!C:K,9,0),\"NVT\")","v":23.503394568690098},{"$f":"IFERROR(VLOOKUP(A80,'Data CAO VVT 2019 (verbergen)'!C:M,11,0),\"NVT\")","v":23.980481316293929},{"$f":"IFERROR(VLOOKUP(A80,'Data CAO GGZ 2019 (verbergen)'!C:M,11,0),\"NVT\")","v":23.304766773162935}]
["40/7",{"$f":"IFERROR(VLOOKUP(A81,'Data CAO GHZ 2019 (verbergen)'!C:K,9,0),\"NVT\")","v":24.148362619808307},{"$f":"IFERROR(VLOOKUP(A81,'Data CAO VVT 2019 (verbergen)'!C:M,11,0),\"NVT\")","v":24.600212498402559},{"$f":"IFERROR(VLOOKUP(A81,'Data CAO GGZ 2019 (verbergen)'!C:M,11,0),\"NVT\")","v":23.908370607028758}]
["40/8",{"$f":"IFERROR(VLOOKUP(A82,'Data CAO GHZ 2019 (verbergen)'!C:K,9,0),\"NVT\")","v":24.75539137380192},{"$f":"IFERROR(VLOOKUP(A82,'Data CAO VVT 2019 (verbergen)'!C:M,11,0),\"NVT\")","v":25.207481955271565},{"$f":"IFERROR(VLOOKUP(A82,'Data CAO GGZ 2019 (verbergen)'!C:M,11,0),\"NVT\")","v":24.511974440894569}]
["40/9",{"$f":"IFERROR(VLOOKUP(A83,'Data CAO GHZ 2019 (verbergen)'!C:K,9,0),\"NVT\")","v":25.371904952076676},{"$f":"IFERROR(VLOOKUP(A83,'Data CAO VVT 2019 (verbergen)'!C:M,11,0),\"NVT\")","v":25.827021418530354},{"$f":"IFERROR(VLOOKUP(A83,'Data CAO GGZ 2019 (verbergen)'!C:M,11,0),\"NVT\")","v":25.115578274760384}]
["40/10",{"$f":"IFERROR(VLOOKUP(A84,'Data CAO GHZ 2019 (verbergen)'!C:K,9,0),\"NVT\")","v":26.00738817891374},{"$f":"IFERROR(VLOOKUP(A84,'Data CAO VVT 2019 (verbergen)'!C:M,11,0),\"NVT\")","v":26.458830888178916},{"$f":"IFERROR(VLOOKUP(A84,'Data CAO GGZ 2019 (verbergen)'!C:M,11,0),\"NVT\")","v":25.719182108626196}]
["40/11",{"$f":"IFERROR(VLOOKUP(A85,'Data CAO GHZ 2019 (verbergen)'!C:K,9,0),\"NVT\")","v":26.623901757188499},null,{"$f":"IFERROR(VLOOKUP(A85,'Data CAO GGZ 2019 (verbergen)'!C:M,11,0),\"NVT\")","v":26.341648562300318}]
["40/12",null,null,{"$f":"IFERROR(VLOOKUP(A86,'Data CAO GGZ 2019 (verbergen)'!C:M,11,0),\"NVT\")","v":27.001840255591059}]
["45/0",{"$f":"IFERROR(VLOOKUP(A87,'Data CAO GHZ 2019 (verbergen)'!C:K,9,0),\"NVT\")","v":19.121405750798726},{"$f":"IFERROR(VLOOKUP(A87,'Data CAO VVT 2019 (verbergen)'!C:M,11,0),\"NVT\")","v":23.980481316293929},{"$f":"IFERROR(VLOOKUP(A87,'Data CAO GGZ 2019 (verbergen)'!C:M,11,0),\"NVT\")","v":20.956370607028756}]
["45/1",{"$f":"IFERROR(VLOOKUP(A88,'Data CAO GHZ 2019 (verbergen)'!C:K,9,0),\"NVT\")","v":20.420826677316295},{"$f":"IFERROR(VLOOKUP(A88,'Data CAO VVT 2019 (verbergen)'!C:M,11,0),\"NVT\")","v":24.600212498402559},{"$f":"IFERROR(VLOOKUP(A88,'Data CAO GGZ 2019 (verbergen)'!C:M,11,0),\"NVT\")","v":22.116421725239611}]
["45/2",{"$f":"IFERROR(VLOOKUP(A89,'Data CAO GHZ 2019 (verbergen)'!C:K,9,0),\"NVT\")","v":21.691793130990416},{"$f":"IFERROR(VLOOKUP(A89,'Data CAO VVT 2019 (verbergen)'!C:M,11,0),\"NVT\")","v":25.207481955271565},{"$f":"IFERROR(VLOOKUP(A89,'Data CAO GGZ 2019 (verbergen)'!C:M,11,0),\"NVT\")","v":23.304766773162935}]
["45/3",{"$f":"IFERROR(VLOOKUP(A90,'Data CAO GHZ 2019 (verbergen)'!C:K,9,0),\"NVT\")","v":22.886880990415335},{"$f":"IFERROR(VLOOKUP(A90,'Data CAO VVT 2019 (verbergen)'!C:M,11,0),\"NVT\")","v":25.827021418530354},{"$f":"IFERROR(VLOOKUP(A90,'Data CAO GGZ 2019 (verbergen)'!C:M,11,0),\"NVT\")","v":23.908370607028758}]
["45/4",{"$f":"IFERROR(VLOOKUP(A91,'Data CAO GHZ 2019 (verbergen)'!C:K,9,0),\"NVT\")","v":24.148362619808307},{"$f":"IFERROR(VLOOKUP(A91,'Data CAO VVT 2019 (verbergen)'!C:M,11,0),\"NVT\")","v":26.458830888178916},{"$f":"IFERROR(VLOOKUP(A91,'Data CAO GGZ 2019 (verbergen)'!C:M,11,0),\"NVT\")","v":24.511974440894569}]
["45/5",{"$f":"IFERROR(VLOOKUP(A92,'Data CAO GHZ 2019 (verbergen)'!C:K,9,0),\"NVT\")","v":24.75539137380192},{"$f":"IFERROR(VLOOKUP(A92,'Data CAO VVT 2019 (verbergen)'!C:M,11,0),\"NVT\")","v":27.102526926517569},{"$f":"IFERROR(VLOOKUP(A92,'Data CAO GGZ 2019 (verbergen)'!C:M,11,0),\"NVT\")","v":25.115578274760384}]
["45/6",{"$f":"IFERROR(VLOOKUP(A93,'Data CAO GHZ 2019 (verbergen)'!C:K,9,0),\"NVT\")","v":25.371904952076676},{"$f":"IFERROR(VLOOKUP(A93,'Data CAO VVT 2019 (verbergen)'!C:M,11,0),\"NVT\")","v":27.770571258785942},{"$f":"IFERROR(VLOOKUP(A93,'Data CAO GGZ 2019 (verbergen)'!C:M,11,0),\"NVT\")","v":25.719182108626196}]
["45/7",{"$f":"IFERROR(VLOOKUP(A94,'Data CAO GHZ 2019 (verbergen)'!C:K,9,0),\"NVT\")","v":26.00738817891374},{"$f":"IFERROR(VLOOKUP(A94,'Data CAO VVT 2019 (verbergen)'!C:M,11,0),\"NVT\")","v":28.463443182108623},{"$f":"IFERROR(VLOOKUP(A94,'Data CAO GGZ 2019 (verbergen)'!C:M,11,0),\"NVT\")","v":26.341648562300318}]
["45/8",{"$f":"IFERROR(VLOOKUP(A95,'Data CAO GHZ 2019 (verbergen)'!C:K,9,0),\"NVT\")","v":26.623901757188499},{"$f":"IFERROR(VLOOKUP(A95,'Data CAO VVT 2019 (verbergen)'!C:M,11,0),\"NVT\")","v":29.070329201277954},{"$f":"IFERROR(VLOOKUP(A95,'Data CAO GGZ 2019 (verbergen)'!C:M,11,0),\"NVT\")","v":27.001840255591059}]
["45/9",{"$f":"IFERROR(VLOOKUP(A96,'Data CAO GHZ 2019 (verbergen)'!C:K,9,0),\"NVT\")","v":27.287839456869008},null,{"$f":"IFERROR(VLOOKUP(A96,'Data CAO GGZ 2019 (verbergen)'!C:M,11,0),\"NVT\")","v":27.671463258785941}]
["45/10",{"$f":"IFERROR(VLOOKUP(A97,'Data CAO GHZ 2019 (verbergen)'!C:K,9,0),\"NVT\")","v":27.96126198083067},null,{"$f":"IFERROR(VLOOKUP(A97,'Data CAO GGZ 2019 (verbergen)'!C:M,11,0),\"NVT\")","v":28.256204472843446}]
["45/11",{"$f":"IFERROR(VLOOKUP(A98,'Data CAO GHZ 2019 (verbergen)'!C:K,9,0),\"NVT\")","v":28.653654153354633},null,{"$f":"IFERROR(VLOOKUP(A98,'Data CAO GGZ 2019 (verbergen)'!C:M,11,0),\"NVT\")","v":28.916396166134192}]
["45/12",{"$f":"IFERROR(VLOOKUP(A99,'Data CAO GHZ 2019 (verbergen)'!C:K,9,0),\"NVT\")","v":29.251198083067091},null,{"$f":"IFERROR(VLOOKUP(A99,'Data CAO GGZ 2019 (verbergen)'!C:M,11,0),\"NVT\")","v":29.567156549520767}]
["50/0",{"$f":"IFERROR(VLOOKUP(A100,'Data CAO GHZ 2019 (verbergen)'!C:K,9,0),\"NVT\")","v":22.241912939297123},{"$f":"IFERROR(VLOOKUP(A100,'Data CAO VVT 2019 (verbergen)'!C:M,11,0),\"NVT\")","v":24.600212498402559},{"$f":"IFERROR(VLOOKUP(A100,'Data CAO GGZ 2019 (verbergen)'!C:M,11,0),\"NVT\")","v":23.908370607028758}]
["50/1",{"$f":"IFERROR(VLOOKUP(A101,'Data CAO GHZ 2019 (verbergen)'!C:K,9,0),\"NVT\")","v":23.503394568690098},{"$f":"IFERROR(VLOOKUP(A101,'Data CAO VVT 2019 (verbergen)'!C:M,11,0),\"NVT\")","v":25.827021418530354},{"$f":"IFERROR(VLOOKUP(A101,'Data CAO GGZ 2019 (verbergen)'!C:M,11,0),\"NVT\")","v":25.115578274760384}]
["50/2",{"$f":"IFERROR(VLOOKUP(A102,'Data CAO GHZ 2019 (verbergen)'!C:K,9,0),\"NVT\")","v":24.75539137380192},{"$f":"IFERROR(VLOOKUP(A102,'Data CAO VVT 2019 (verbergen)'!C:M,11,0),\"NVT\")","v":27.102526926517569},{"$f":"IFERROR(VLOOKUP(A102,'Data CAO GGZ 2019 (verbergen)'!C:M,11,0),\"NVT\")","v":26.341648562300318}]
["50/3",{"$f":"IFERROR(VLOOKUP(A103,'Data CAO GHZ 2019 (verbergen)'!C:K,9,0),\"NVT\")","v":26.00738817891374},{"$f":"IFERROR(VLOOKUP(A103,'Data CAO VVT 2019 (verbergen)'!C:M,11,0),\"NVT\")","v":28.463443182108623},{"$f":"IFERROR(VLOOKUP(A103,'Data CAO GGZ 2019 (verbergen)'!C:M,11,0),\"NVT\")","v":27.671463258785941}]
["50/4",{"$f":"IFERROR(VLOOKUP(A104,'Data CAO GHZ 2019 (verbergen)'!C:K,9,0),\"NVT\")","v":27.287839456869008},{"$f":"IFERROR(VLOOKUP(A104,'Data CAO VVT 2019 (verbergen)'!C:M,11,0),\"NVT\")","v":29.070329201277954},{"$f":"IFERROR(VLOOKUP(A104,'Data CAO GGZ 2019 (verbergen)'!C:M,11,0),\"NVT\")","v":28.256204472843446}]
["50/5",{"$f":"IFERROR(VLOOKUP(A105,'Data CAO GHZ 2019 (verbergen)'!C:K,9,0),\"NVT\")","v":28.653654153354633},{"$f":"IFERROR(VLOOKUP(A105,'Data CAO VVT 2019 (verbergen)'!C:M,11,0),\"NVT\")","v":29.750739399361024},{"$f":"IFERROR(VLOOKUP(A105,'Data CAO GGZ 2019 (verbergen)'!C:M,11,0),\"NVT\")","v":28.916396166134192}]
["50/6",{"$f":"IFERROR(VLOOKUP(A106,'Data CAO GHZ 2019 (verbergen)'!C:K,9,0),\"NVT\")","v":29.251198083067091},{"$f":"IFERROR(VLOOKUP(A106,'Data CAO VVT 2019 (verbergen)'!C:M,11,0),\"NVT\")","v":30.419167169329079},{"$f":"IFERROR(VLOOKUP(A106,'Data CAO GGZ 2019 (verbergen)'!C:M,11,0),\"NVT\")","v":29.567156549520767}]
["50/7",{"$f":"IFERROR(VLOOKUP(A107,'Data CAO GHZ 2019 (verbergen)'!C:K,9,0),\"NVT\")","v":29.943590255591054},{"$f":"IFERROR(VLOOKUP(A107,'Data CAO VVT 2019 (verbergen)'!C:M,11,0),\"NVT\")","v":31.0507849201278},{"$f":"IFERROR(VLOOKUP(A107,'Data CAO GGZ 2019 (verbergen)'!C:M,11,0),\"NVT\")","v":30.180191693290734}]
["50/8",{"$f":"IFERROR(VLOOKUP(A108,'Data CAO GHZ 2019 (verbergen)'!C:K,9,0),\"NVT\")","v":30.607527955271561},{"$f":"IFERROR(VLOOKUP(A108,'Data CAO VVT 2019 (verbergen)'!C:M,11,0),\"NVT\")","v":31.682210952076677},{"$f":"IFERROR(VLOOKUP(A108,'Data CAO GGZ 2019 (verbergen)'!C:M,11,0),\"NVT\")","v":30.802658146964863}]
["50/9",{"$f":"IFERROR(VLOOKUP(A109,'Data CAO GHZ 2019 (verbergen)'!C:K,9,0),\"NVT\")","v":31.243011182108628},{"$f":"IFERROR(VLOOKUP(A109,'Data CAO VVT 2019 (verbergen)'!C:M,11,0),\"NVT\")","v":32.350447003194887},{"$f":"IFERROR(VLOOKUP(A109,'Data CAO GGZ 2019 (verbergen)'!C:M,11,0),\"NVT\")","v":31.443987220447287}]
["50/10",{"$f":"IFERROR(VLOOKUP(A110,'Data CAO GHZ 2019 (verbergen)'!C:K,9,0),\"NVT\")","v":31.90694888178913},{"$f":"IFERROR(VLOOKUP(A110,'Data CAO VVT 2019 (verbergen)'!C:M,11,0),\"NVT\")","v":33.018587194888184},{"$f":"IFERROR(VLOOKUP(A110,'Data CAO GGZ 2019 (verbergen)'!C:M,11,0),\"NVT\")","v":32.094747603833859}]
["50/11",{"$f":"IFERROR(VLOOKUP(A111,'Data CAO GHZ 2019 (verbergen)'!C:K,9,0),\"NVT\")","v":32.551916932907346},null,{"$f":"IFERROR(VLOOKUP(A111,'Data CAO GGZ 2019 (verbergen)'!C:M,11,0),\"NVT\")","v":32.698351437699685}]
["50/12",{"$f":"IFERROR(VLOOKUP(A112,'Data CAO GHZ 2019 (verbergen)'!C:K,9,0),\"NVT\")","v":33.244309105431313}]
["55/0",{"$f":"IFERROR(VLOOKUP(A113,'Data CAO GHZ 2019 (verbergen)'!C:K,9,0),\"NVT\")","v":25.371904952076676},{"$f":"IFERROR(VLOOKUP(A113,'Data CAO VVT 2019 (verbergen)'!C:M,11,0),\"NVT\")","v":25.827021418530354},{"$f":"IFERROR(VLOOKUP(A113,'Data CAO GGZ 2019 (verbergen)'!C:M,11,0),\"NVT\")","v":27.001840255591059}]
["55/1",{"$f":"IFERROR(VLOOKUP(A114,'Data CAO GHZ 2019 (verbergen)'!C:K,9,0),\"NVT\")","v":26.623901757188499},{"$f":"IFERROR(VLOOKUP(A114,'Data CAO VVT 2019 (verbergen)'!C:M,11,0),\"NVT\")","v":27.770571258785942},{"$f":"IFERROR(VLOOKUP(A114,'Data CAO GGZ 2019 (verbergen)'!C:M,11,0),\"NVT\")","v":28.256204472843446}]
["55/2",{"$f":"IFERROR(VLOOKUP(A115,'Data CAO GHZ 2019 (verbergen)'!C:K,9,0),\"NVT\")","v":27.96126198083067},{"$f":"IFERROR(VLOOKUP(A115,'Data CAO VVT 2019 (verbergen)'!C:M,11,0),\"NVT\")","v":29.070329201277954},{"$f":"IFERROR(VLOOKUP(A115,'Data CAO GGZ 2019 (verbergen)'!C:M,11,0),\"NVT\")","v":29.567156549520767}]
["55/3",{"$f":"IFERROR(VLOOKUP(A116,'Data CAO GHZ 2019 (verbergen)'!C:K,9,0),\"NVT\")","v":29.251198083067091},{"$f":"IFERROR(VLOOKUP(A116,'Data CAO VVT 2019 (verbergen)'!C:M,11,0),\"NVT\")","v":30.419167169329079},{"$f":"IFERROR(VLOOKUP(A116,'Data CAO GGZ 2019 (verbergen)'!C:M,11,0),\"NVT\")","v":30.802658146964863}]
["55/4",{"$f":"IFERROR(VLOOKUP(A117,'Data CAO GHZ 2019 (verbergen)'!C:K,9,0),\"NVT\")","v":30.607527955271561},{"$f":"IFERROR(VLOOKUP(A117,'Data CAO VVT 2019 (verbergen)'!C:M,11,0),\"NVT\")","v":31.682210952076677},{"$f":"IFERROR(VLOOKUP(A117,'Data CAO GGZ 2019 (verbergen)'!C:M,11,0),\"NVT\")","v":32.094747603833859}]
["55/5",{"$f":"IFERROR(VLOOKUP(A118,'Data CAO GHZ 2019 (verbergen)'!C:K,9,0),\"NVT\")","v":31.90694888178913},{"$f":"IFERROR(VLOOKUP(A118,'Data CAO VVT 2019 (verbergen)'!C:M,11,0),\"NVT\")","v":33.018587194888184},{"$f":"IFERROR(VLOOKUP(A118,'Data CAO GGZ 2019 (verbergen)'!C:M,11,0),\"NVT\")","v":32.698351437699685}]
["55/6",{"$f":"IFERROR(VLOOKUP(A119,'Data CAO GHZ 2019 (verbergen)'!C:K,9,0),\"NVT\")","v":33.244309105431313},{"$f":"IFERROR(VLOOKUP(A119,'Data CAO VVT 2019 (verbergen)'!C:M,11,0),\"NVT\")","v":33.638414236421724},{"$f":"IFERROR(VLOOKUP(A119,'Data CAO GGZ 2019 (verbergen)'!C:M,11,0),\"NVT\")","v":33.311386581469648}]
["55/7",{"$f":"IFERROR(VLOOKUP(A120,'Data CAO GHZ 2019 (verbergen)'!C:K,9,0),\"NVT\")","v":33.879792332268373},{"$f":"IFERROR(VLOOKUP(A120,'Data CAO VVT 2019 (verbergen)'!C:M,11,0),\"NVT\")","v":34.257857840255596},{"$f":"IFERROR(VLOOKUP(A120,'Data CAO GGZ 2019 (verbergen)'!C:M,11,0),\"NVT\")","v":33.999872204472844}]
["55/8",{"$f":"IFERROR(VLOOKUP(A121,'Data CAO GHZ 2019 (verbergen)'!C:K,9,0),\"NVT\")","v":34.61960862619808},{"$f":"IFERROR(VLOOKUP(A121,'Data CAO VVT 2019 (verbergen)'!C:M,11,0),\"NVT\")","v":34.974790479233228},{"$f":"IFERROR(VLOOKUP(A121,'Data CAO GGZ 2019 (verbergen)'!C:M,11,0),\"NVT\")","v":34.707220447284335}]
["55/9",{"$f":"IFERROR(VLOOKUP(A122,'Data CAO GHZ 2019 (verbergen)'!C:K,9,0),\"NVT\")","v":35.359424920127793},{"$f":"IFERROR(VLOOKUP(A122,'Data CAO VVT 2019 (verbergen)'!C:M,11,0),\"NVT\")","v":35.703609686900961},{"$f":"IFERROR(VLOOKUP(A122,'Data CAO GGZ 2019 (verbergen)'!C:M,11,0),\"NVT\")","v":35.40513738019169}]
["55/10",{"$f":"IFERROR(VLOOKUP(A123,'Data CAO GHZ 2019 (verbergen)'!C:K,9,0),\"NVT\")","v":36.099241214057507},{"$f":"IFERROR(VLOOKUP(A123,'Data CAO VVT 2019 (verbergen)'!C:M,11,0),\"NVT\")","v":36.420350607028752},{"$f":"IFERROR(VLOOKUP(A123,'Data CAO GGZ 2019 (verbergen)'!C:M,11,0),\"NVT\")","v":36.027603833865825}]
["55/11",{"$f":"IFERROR(VLOOKUP(A124,'Data CAO GHZ 2019 (verbergen)'!C:K,9,0),\"NVT\")","v":36.791633386581466},{"$f":"IFERROR(VLOOKUP(A124,'Data CAO VVT 2019 (verbergen)'!C:M,11,0),\"NVT\")","v":37.064238364217253},{"$f":"IFERROR(VLOOKUP(A124,'Data CAO GGZ 2019 (verbergen)'!C:M,11,0),\"NVT\")","v":36.725520766773165}]
["55/12",{"$f":"IFERROR(VLOOKUP(A125,'Data CAO GHZ 2019 (verbergen)'!C:K,9,0),\"NVT\")","v":37.446086261980831}]
["60/0",{"$f":"IFERROR(VLOOKUP(A126,'Data CAO GHZ 2019 (verbergen)'!C:K,9,0),\"NVT\")","v":29.251198083067091},{"$f":"IFERROR(VLOOKUP(A126,'Data CAO VVT 2019 (verbergen)'!C:M,11,0),\"NVT\")","v":31.682210952076677},{"$f":"IFERROR(VLOOKUP(A126,'Data CAO GGZ 2019 (verbergen)'!C:M,11,0),\"NVT\")","v":30.802658146964863}]
["60/1",{"$f":"IFERROR(VLOOKUP(A127,'Data CAO GHZ 2019 (verbergen)'!C:K,9,0),\"NVT\")","v":30.607527955271561},{"$f":"IFERROR(VLOOKUP(A127,'Data CAO VVT 2019 (verbergen)'!C:M,11,0),\"NVT\")","v":33.018587194888184},{"$f":"IFERROR(VLOOKUP(A127,'Data CAO GGZ 2019 (verbergen)'!C:M,11,0),\"NVT\")","v":32.094747603833859}]
["60/2",{"$f":"IFERROR(VLOOKUP(A128,'Data CAO GHZ 2019 (verbergen)'!C:K,9,0),\"NVT\")","v":31.90694888178913},{"$f":"IFERROR(VLOOKUP(A128,'Data CAO VVT 2019 (verbergen)'!C:M,11,0),\"NVT\")","v":34.257857840255596},{"$f":"IFERROR(VLOOKUP(A128,'Data CAO GGZ 2019 (verbergen)'!C:M,11,0),\"NVT\")","v":33.311386581469648}]
["60/3",{"$f":"IFERROR(VLOOKUP(A129,'Data CAO GHZ 2019 (verbergen)'!C:K,9,0),\"NVT\")","v":33.244309105431313},{"$f":"IFERROR(VLOOKUP(A129,'Data CAO VVT 2019 (verbergen)'!C:M,11,0),\"NVT\")","v":35.703609686900961},{"$f":"IFERROR(VLOOKUP(A129,'Data CAO GGZ 2019 (verbergen)'!C:M,11,0),\"NVT\")","v":34.707220447284335}]
["60/4",{"$f":"IFERROR(VLOOKUP(A130,'Data CAO GHZ 2019 (verbergen)'!C:K,9,0),\"NVT\")","v":34.61960862619808},{"$f":"IFERROR(VLOOKUP(A130,'Data CAO VVT 2019 (verbergen)'!C:M,11,0),\"NVT\")","v":37.064238364217253},{"$f":"IFERROR(VLOOKUP(A130,'Data CAO GGZ 2019 (verbergen)'!C:M,11,0),\"NVT\")","v":36.027603833865825}]
["60/5",{"$f":"IFERROR(VLOOKUP(A131,'Data CAO GHZ 2019 (verbergen)'!C:K,9,0),\"NVT\")","v":36.099241214057507},{"$f":"IFERROR(VLOOKUP(A131,'Data CAO VVT 2019 (verbergen)'!C:M,11,0),\"NVT\")","v":38.46138948242811},{"$f":"IFERROR(VLOOKUP(A131,'Data CAO GGZ 2019 (verbergen)'!C:M,11,0),\"NVT\")","v":37.395143769968044}]
["60/6",{"$f":"IFERROR(VLOOKUP(A132,'Data CAO GHZ 2019 (verbergen)'!C:K,9,0),\"NVT\")","v":37.446086261980831},{"$f":"IFERROR(VLOOKUP(A132,'Data CAO VVT 2019 (verbergen)'!C:M,11,0),\"NVT\")","v":39.809460575079875},{"$f":"IFERROR(VLOOKUP(A132,'Data CAO GGZ 2019 (verbergen)'!C:M,11,0),\"NVT\")","v":38.706095846645361}]
["60/7",{"$f":"IFERROR(VLOOKUP(A133,'Data CAO GHZ 2019 (verbergen)'!C:K,9,0),\"NVT\")","v":38.849840255591054},{"$f":"IFERROR(VLOOKUP(A133,'Data CAO VVT 2019 (verbergen)'!C:M,11,0),\"NVT\")","v":40.40493932268371},{"$f":"IFERROR(VLOOKUP(A133,'Data CAO GGZ 2019 (verbergen)'!C:M,11,0),\"NVT\")","v":39.281405750798719}]
["60/8",{"$f":"IFERROR(VLOOKUP(A134,'Data CAO GHZ 2019 (verbergen)'!C:K,9,0),\"NVT\")","v":40.244109424920119},{"$f":"IFERROR(VLOOKUP(A134,'Data CAO VVT 2019 (verbergen)'!C:M,11,0),\"NVT\")","v":41.012304638977632},{"$f":"IFERROR(VLOOKUP(A134,'Data CAO GGZ 2019 (verbergen)'!C:M,11,0),\"NVT\")","v":39.875578274760379}]
["60/9",{"$f":"IFERROR(VLOOKUP(A135,'Data CAO GHZ 2019 (verbergen)'!C:K,9,0),\"NVT\")","v":40.813198881789134},{"$f":"IFERROR(VLOOKUP(A135,'Data CAO VVT 2019 (verbergen)'!C:M,11,0),\"NVT\")","v":41.643922389776364},{"$f":"IFERROR(VLOOKUP(A135,'Data CAO GGZ 2019 (verbergen)'!C:M,11,0),\"NVT\")","v":40.488613418530342}]
["60/10",{"$f":"IFERROR(VLOOKUP(A136,'Data CAO GHZ 2019 (verbergen)'!C:K,9,0),\"NVT\")","v":41.439197284345049},{"$f":"IFERROR(VLOOKUP(A136,'Data CAO VVT 2019 (verbergen)'!C:M,11,0),\"NVT\")","v":42.251479424920113},{"$f":"IFERROR(VLOOKUP(A136,'Data CAO GGZ 2019 (verbergen)'!C:M,11,0),\"NVT\")","v":41.073354632587851}]
["60/11",{"$f":"IFERROR(VLOOKUP(A137,'Data CAO GHZ 2019 (verbergen)'!C:K,9,0),\"NVT\")","v":42.074680511182109}]
["60/12",{"$f":"IFERROR(VLOOKUP(A138,'Data CAO GHZ 2019 (verbergen)'!C:K,9,0),\"NVT\")","v":42.672224440894567}]
["65/0",{"$f":"IFERROR(VLOOKUP(A139,'Data CAO GHZ 2019 (verbergen)'!C:K,9,0),\"NVT\")","v":33.244309105431313},{"$f":"IFERROR(VLOOKUP(A139,'Data CAO VVT 2019 (verbergen)'!C:M,11,0),\"NVT\")","v":35.703609686900961},{"$f":"IFERROR(VLOOKUP(A139,'Data CAO GGZ 2019 (verbergen)'!C:M,11,0),\"NVT\")","v":36.027603833865825}]
["65/1",{"$f":"IFERROR(VLOOKUP(A140,'Data CAO GHZ 2019 (verbergen)'!C:K,9,0),\"NVT\")","v":35.359424920127793},{"$f":"IFERROR(VLOOKUP(A140,'Data CAO VVT 2019 (verbergen)'!C:M,11,0),\"NVT\")","v":37.064238364217253},{"$f":"IFERROR(VLOOKUP(A140,'Data CAO GGZ 2019 (verbergen)'!C:M,11,0),\"NVT\")","v":37.395143769968044}]
["65/2",{"$f":"IFERROR(VLOOKUP(A141,'Data CAO GHZ 2019 (verbergen)'!C:K,9,0),\"NVT\")","v":37.446086261980831},{"$f":"IFERROR(VLOOKUP(A141,'Data CAO VVT 2019 (verbergen)'!C:M,11,0),\"NVT\")","v":37.780979284345051},{"$f":"IFERROR(VLOOKUP(A141,'Data CAO GGZ 2019 (verbergen)'!C:M,11,0),\"NVT\")","v":38.706095846645361}]
["65/3",{"$f":"IFERROR(VLOOKUP(A142,'Data CAO GHZ 2019 (verbergen)'!C:K,9,0),\"NVT\")","v":38.849840255591054},{"$f":"IFERROR(VLOOKUP(A142,'Data CAO VVT 2019 (verbergen)'!C:M,11,0),\"NVT\")","v":38.46138948242811},{"$f":"IFERROR(VLOOKUP(A142,'Data CAO GGZ 2019 (verbergen)'!C:M,11,0),\"NVT\")","v":39.875578274760379}]
["65/4",{"$f":"IFERROR(VLOOKUP(A143,'Data CAO GHZ 2019 (verbergen)'!C:K,9,0),\"NVT\")","v":40.244109424920119},{"$f":"IFERROR(VLOOKUP(A143,'Data CAO VVT 2019 (verbergen)'!C:M,11,0),\"NVT\")","v":39.153782108626203},{"$f":"IFERROR(VLOOKUP(A143,'Data CAO GGZ 2019 (verbergen)'!C:M,11,0),\"NVT\")","v":41.073354632587851}]
["65/5",{"$f":"IFERROR(VLOOKUP(A144,'Data CAO GHZ 2019 (verbergen)'!C:K,9,0),\"NVT\")","v":41.439197284345049},{"$f":"IFERROR(VLOOKUP(A144,'Data CAO VVT 2019 (verbergen)'!C:M,11,0),\"NVT\")","v":39.809460575079875},{"$f":"IFERROR(VLOOKUP(A144,'Data CAO GGZ 2019 (verbergen)'!C:M,11,0),\"NVT\")","v":42.299424920127798}]
["65/6",{"$f":"IFERROR(VLOOKUP(A145,'Data CAO GHZ 2019 (verbergen)'!C:K,9,0),\"NVT\")","v":42.672224440894567},{"$f":"IFERROR(VLOOKUP(A145,'Data CAO VVT 2019 (verbergen)'!C:M,11,0),\"NVT\")","v":41.012304638977632},{"$f":"IFERROR(VLOOKUP(A145,'Data CAO GGZ 2019 (verbergen)'!C:M,11,0),\"NVT\")","v":43.506632587859421}]
["65/7",{"$f":"IFERROR(VLOOKUP(A146,'Data CAO GHZ 2019 (verbergen)'!C:K,9,0),\"NVT\")","v":43.962160543130992},{"$f":"IFERROR(VLOOKUP(A146,'Data CAO VVT 2019 (verbergen)'!C:M,11,0),\"NVT\")","v":42.251479424920113},{"$f":"IFERROR(VLOOKUP(A146,'Data CAO GGZ 2019 (verbergen)'!C:M,11,0),\"NVT\")","v":44.713840255591052}]
["65/8",{"$f":"IFERROR(VLOOKUP(A147,'Data CAO GHZ 2019 (verbergen)'!C:K,9,0),\"NVT\")","v":45.223642172523959},{"$f":"IFERROR(VLOOKUP(A147,'Data CAO VVT 2019 (verbergen)'!C:M,11,0),\"NVT\")","v":43.502732498402565},{"$f":"IFERROR(VLOOKUP(A147,'Data CAO GGZ 2019 (verbergen)'!C:M,11,0),\"NVT\")","v":45.939910543130992}]
["65/9",{"$f":"IFERROR(VLOOKUP(A148,'Data CAO GHZ 2019 (verbergen)'!C:K,9,0),\"NVT\")","v":46.456669329073485},{"$f":"IFERROR(VLOOKUP(A148,'Data CAO VVT 2019 (verbergen)'!C:M,11,0),\"NVT\")","v":44.741619706070281},{"$f":"IFERROR(VLOOKUP(A148,'Data CAO GGZ 2019 (verbergen)'!C:M,11,0),\"NVT\")","v":46.524651757188501}]
["65/10",{"$f":"IFERROR(VLOOKUP(A149,'Data CAO GHZ 2019 (verbergen)'!C:K,9,0),\"NVT\")","v":47.746605431309902},{"$f":"IFERROR(VLOOKUP(A149,'Data CAO VVT 2019 (verbergen)'!C:M,11,0),\"NVT\")","v":45.992968638977629},{"$f":"IFERROR(VLOOKUP(A149,'Data CAO GGZ 2019 (verbergen)'!C:M,11,0),\"NVT\")","v":47.128255591054319}]
["65/11",{"$f":"IFERROR(VLOOKUP(A150,'Data CAO GHZ 2019 (verbergen)'!C:K,9,0),\"NVT\")","v":48.344149361022367},{"$f":"IFERROR(VLOOKUP(A150,'Data CAO VVT 2019 (verbergen)'!C:M,11,0),\"NVT\")","v":47.244317571884977},{"$f":"IFERROR(VLOOKUP(A150,'Data CAO GGZ 2019 (verbergen)'!C:M,11,0),\"NVT\")","v":47.750722044728434}]
["65/12",{"$f":"IFERROR(VLOOKUP(A151,'Data CAO GHZ 2019 (verbergen)'!C:K,9,0),\"NVT\")","v":48.998602236421718},{"$f":"IFERROR(VLOOKUP(A151,'Data CAO VVT 2019 (verbergen)'!C:M,11,0),\"NVT\")","v":47.851778747603831},{"$f":"IFERROR(VLOOKUP(A151,'Data CAO GGZ 2019 (verbergen)'!C:M,11,0),\"NVT\")","v":48.344894568690094}]
["65/13",{"$f":"IFERROR(VLOOKUP(A152,'Data CAO GHZ 2019 (verbergen)'!C:K,9,0),\"NVT\")","v":49.61511581469648},{"$f":"IFERROR(VLOOKUP(A152,'Data CAO VVT 2019 (verbergen)'!C:M,11,0),\"NVT\")","v":48.471126492012779}]
["65/14",{"$f":"IFERROR(VLOOKUP(A153,'Data CAO GHZ 2019 (verbergen)'!C:K,9,0),\"NVT\")","v":50.23162939297125},{"$f":"IFERROR(VLOOKUP(A153,'Data CAO VVT 2019 (verbergen)'!C:M,11,0),\"NVT\")","v":49.115110108626197}]
["65/15",null,{"$f":"IFERROR(VLOOKUP(A154,'Data CAO VVT 2019 (verbergen)'!C:M,11,0),\"NVT\")","v":49.734649571884987}]
["70/0",{"$f":"IFERROR(VLOOKUP(A155,'Data CAO GHZ 2019 (verbergen)'!C:K,9,0),\"NVT\")","v":40.244109424920119},{"$f":"IFERROR(VLOOKUP(A155,'Data CAO VVT 2019 (verbergen)'!C:M,11,0),\"NVT\")","v":42.251479424920113},{"$f":"IFERROR(VLOOKUP(A155,'Data CAO GGZ 2019 (verbergen)'!C:M,11,0),\"NVT\")","v":42.299424920127798}]
["70/1",{"$f":"IFERROR(VLOOKUP(A156,'Data CAO GHZ 2019 (verbergen)'!C:K,9,0),\"NVT\")","v":42.074680511182109},{"$f":"IFERROR(VLOOKUP(A156,'Data CAO VVT 2019 (verbergen)'!C:M,11,0),\"NVT\")","v":43.502732498402565},{"$f":"IFERROR(VLOOKUP(A156,'Data CAO GGZ 2019 (verbergen)'!C:M,11,0),\"NVT\")","v":44.129099041533536}]
["70/2",{"$f":"IFERROR(VLOOKUP(A157,'Data CAO GHZ 2019 (verbergen)'!C:K,9,0),\"NVT\")","v":43.962160543130992},{"$f":"IFERROR(VLOOKUP(A157,'Data CAO VVT 2019 (verbergen)'!C:M,11,0),\"NVT\")","v":44.134350249201276},{"$f":"IFERROR(VLOOKUP(A157,'Data CAO GGZ 2019 (verbergen)'!C:M,11,0),\"NVT\")","v":45.939910543130992}]
["70/3",{"$f":"IFERROR(VLOOKUP(A158,'Data CAO GHZ 2019 (verbergen)'!C:K,9,0),\"NVT\")","v":45.840155750798722},{"$f":"IFERROR(VLOOKUP(A158,'Data CAO VVT 2019 (verbergen)'!C:M,11,0),\"NVT\")","v":44.741619706070281},{"$f":"IFERROR(VLOOKUP(A158,'Data CAO GGZ 2019 (verbergen)'!C:M,11,0),\"NVT\")","v":47.750722044728434}]
["70/4",{"$f":"IFERROR(VLOOKUP(A159,'Data CAO GHZ 2019 (verbergen)'!C:K,9,0),\"NVT\")","v":47.746605431309902},{"$f":"IFERROR(VLOOKUP(A159,'Data CAO VVT 2019 (verbergen)'!C:M,11,0),\"NVT\")","v":45.385603322683707},{"$f":"IFERROR(VLOOKUP(A159,'Data CAO GGZ 2019 (verbergen)'!C:M,11,0),\"NVT\")","v":49.561533546325876}]
["70/5",{"$f":"IFERROR(VLOOKUP(A160,'Data CAO GHZ 2019 (verbergen)'!C:K,9,0),\"NVT\")","v":49.61511581469648},{"$f":"IFERROR(VLOOKUP(A160,'Data CAO VVT 2019 (verbergen)'!C:M,11,0),\"NVT\")","v":47.244317571884977},{"$f":"IFERROR(VLOOKUP(A160,'Data CAO GGZ 2019 (verbergen)'!C:M,11,0),\"NVT\")","v":50.778172523961658}]
["70/6",{"$f":"IFERROR(VLOOKUP(A161,'Data CAO GHZ 2019 (verbergen)'!C:K,9,0),\"NVT\")","v":51.502595846645363},{"$f":"IFERROR(VLOOKUP(A161,'Data CAO VVT 2019 (verbergen)'!C:M,11,0),\"NVT\")","v":49.115110108626197},{"$f":"IFERROR(VLOOKUP(A161,'Data CAO GGZ 2019 (verbergen)'!C:M,11,0),\"NVT\")","v":52.287182108626197}]
["70/7",{"$f":"IFERROR(VLOOKUP(A162,'Data CAO GHZ 2019 (verbergen)'!C:K,9,0),\"NVT\")","v":52.77356230031949},{"$f":"IFERROR(VLOOKUP(A162,'Data CAO VVT 2019 (verbergen)'!C:M,11,0),\"NVT\")","v":50.98590264536741},{"$f":"IFERROR(VLOOKUP(A162,'Data CAO GGZ 2019 (verbergen)'!C:M,11,0),\"NVT\")","v":53.805623003194874}]
["70/8",{"$f":"IFERROR(VLOOKUP(A163,'Data CAO GHZ 2019 (verbergen)'!C:K,9,0),\"NVT\")","v":54.357527955271557},{"$f":"IFERROR(VLOOKUP(A163,'Data CAO VVT 2019 (verbergen)'!C:M,11,0),\"NVT\")","v":52.237059859424924},{"$f":"IFERROR(VLOOKUP(A163,'Data CAO GGZ 2019 (verbergen)'!C:M,11,0),\"NVT\")","v":55.314632587859421}]
["70/9",{"$f":"IFERROR(VLOOKUP(A164,'Data CAO GHZ 2019 (verbergen)'!C:K,9,0),\"NVT\")","v":55.913039137380188},{"$f":"IFERROR(VLOOKUP(A164,'Data CAO VVT 2019 (verbergen)'!C:M,11,0),\"NVT\")","v":53.780300741214063},{"$f":"IFERROR(VLOOKUP(A164,'Data CAO GGZ 2019 (verbergen)'!C:M,11,0),\"NVT\")","v":56.069137380191705}]
["70/10",{"$f":"IFERROR(VLOOKUP(A165,'Data CAO GHZ 2019 (verbergen)'!C:K,9,0),\"NVT\")","v":57.487519968051117},{"$f":"IFERROR(VLOOKUP(A165,'Data CAO VVT 2019 (verbergen)'!C:M,11,0),\"NVT\")","v":55.347123041533557},{"$f":"IFERROR(VLOOKUP(A165,'Data CAO GGZ 2019 (verbergen)'!C:M,11,0),\"NVT\")","v":56.842504792332264}]
["70/11",{"$f":"IFERROR(VLOOKUP(A166,'Data CAO GHZ 2019 (verbergen)'!C:K,9,0),\"NVT\")","v":58.303214856230035},{"$f":"IFERROR(VLOOKUP(A166,'Data CAO VVT 2019 (verbergen)'!C:M,11,0),\"NVT\")","v":56.902154632587859},{"$f":"IFERROR(VLOOKUP(A166,'Data CAO GGZ 2019 (verbergen)'!C:M,11,0),\"NVT\")","v":57.597009584664541}]
["70/12",{"$f":"IFERROR(VLOOKUP(A167,'Data CAO GHZ 2019 (verbergen)'!C:K,9,0),\"NVT\")","v":59.080970447284344},{"$f":"IFERROR(VLOOKUP(A167,'Data CAO VVT 2019 (verbergen)'!C:M,11,0),\"NVT\")","v":57.667496281150164},{"$f":"IFERROR(VLOOKUP(A167,'Data CAO GGZ 2019 (verbergen)'!C:M,11,0),\"NVT\")","v":58.360945686900955}]
["70/13",{"$f":"IFERROR(VLOOKUP(A168,'Data CAO GHZ 2019 (verbergen)'!C:K,9,0),\"NVT\")","v":59.858726038338659},{"$f":"IFERROR(VLOOKUP(A168,'Data CAO VVT 2019 (verbergen)'!C:M,11,0),\"NVT\")","v":58.46907279233227}]
["70/14",{"$f":"IFERROR(VLOOKUP(A169,'Data CAO GHZ 2019 (verbergen)'!C:K,9,0),\"NVT\")","v":60.664936102236425},{"$f":"IFERROR(VLOOKUP(A169,'Data CAO VVT 2019 (verbergen)'!C:M,11,0),\"NVT\")","v":59.246780306709269}]
["70/15",null,{"$f":"IFERROR(VLOOKUP(A170,'Data CAO VVT 2019 (verbergen)'!C:M,11,0),\"NVT\")","v":60.02429610223642}]
["75/0",{"$f":"IFERROR(VLOOKUP(A171,'Data CAO GHZ 2019 (verbergen)'!C:K,9,0),\"NVT\")","v":47.746605431309902},{"$f":"IFERROR(VLOOKUP(A171,'Data CAO VVT 2019 (verbergen)'!C:M,11,0),\"NVT\")","v":48.471126492012779},{"$f":"IFERROR(VLOOKUP(A171,'Data CAO GGZ 2019 (verbergen)'!C:M,11,0),\"NVT\")","v":49.561533546325876}]
["75/1",{"$f":"IFERROR(VLOOKUP(A172,'Data CAO GHZ 2019 (verbergen)'!C:K,9,0),\"NVT\")","v":49.61511581469648},{"$f":"IFERROR(VLOOKUP(A172,'Data CAO VVT 2019 (verbergen)'!C:M,11,0),\"NVT\")","v":49.734649571884987},{"$f":"IFERROR(VLOOKUP(A172,'Data CAO GGZ 2019 (verbergen)'!C:M,11,0),\"NVT\")","v":51.523246006389776}]
["75/2",{"$f":"IFERROR(VLOOKUP(A173,'Data CAO GHZ 2019 (verbergen)'!C:K,9,0),\"NVT\")","v":51.502595846645363},{"$f":"IFERROR(VLOOKUP(A173,'Data CAO VVT 2019 (verbergen)'!C:M,11,0),\"NVT\")","v":50.98590264536741},{"$f":"IFERROR(VLOOKUP(A173,'Data CAO GGZ 2019 (verbergen)'!C:M,11,0),\"NVT\")","v":53.805623003194874}]
["75/3",{"$f":"IFERROR(VLOOKUP(A174,'Data CAO GHZ 2019 (verbergen)'!C:K,9,0),\"NVT\")","v":53.560802715654965},{"$f":"IFERROR(VLOOKUP(A174,'Data CAO VVT 2019 (verbergen)'!C:M,11,0),\"NVT\")","v":51.593363821086264},{"$f":"IFERROR(VLOOKUP(A174,'Data CAO GGZ 2019 (verbergen)'!C:M,11,0),\"NVT\")","v":56.069137380191705}]
["75/4",{"$f":"IFERROR(VLOOKUP(A175,'Data CAO GHZ 2019 (verbergen)'!C:K,9,0),\"NVT\")","v":55.913039137380188},{"$f":"IFERROR(VLOOKUP(A175,'Data CAO VVT 2019 (verbergen)'!C:M,11,0),\"NVT\")","v":52.237059859424924},{"$f":"IFERROR(VLOOKUP(A175,'Data CAO GGZ 2019 (verbergen)'!C:M,11,0),\"NVT\")","v":58.360945686900955}]
["75/5",{"$f":"IFERROR(VLOOKUP(A176,'Data CAO GHZ 2019 (verbergen)'!C:K,9,0),\"NVT\")","v":58.303214856230035},{"$f":"IFERROR(VLOOKUP(A176,'Data CAO VVT 2019 (verbergen)'!C:M,11,0),\"NVT\")","v":53.002401507987216},{"$f":"IFERROR(VLOOKUP(A176,'Data CAO GGZ 2019 (verbergen)'!C:M,11,0),\"NVT\")","v":59.879386581469646}]
["75/6",{"$f":"IFERROR(VLOOKUP(A177,'Data CAO GHZ 2019 (verbergen)'!C:K,9,0),\"NVT\")","v":60.664936102236425},{"$f":"IFERROR(VLOOKUP(A177,'Data CAO VVT 2019 (verbergen)'!C:M,11,0),\"NVT\")","v":55.347123041533557},{"$f":"IFERROR(VLOOKUP(A177,'Data CAO GGZ 2019 (verbergen)'!C:M,11,0),\"NVT\")","v":61.473277955271563}]
["75/7",{"$f":"IFERROR(VLOOKUP(A178,'Data CAO GHZ 2019 (verbergen)'!C:K,9,0),\"NVT\")","v":62.220447284345049},{"$f":"IFERROR(VLOOKUP(A178,'Data CAO VVT 2019 (verbergen)'!C:M,11,0),\"NVT\")","v":57.667496281150164},{"$f":"IFERROR(VLOOKUP(A178,'Data CAO GGZ 2019 (verbergen)'!C:M,11,0),\"NVT\")","v":63.161482428115022}]
["75/8",{"$f":"IFERROR(VLOOKUP(A179,'Data CAO GHZ 2019 (verbergen)'!C:K,9,0),\"NVT\")","v":63.889776357827479},{"$f":"IFERROR(VLOOKUP(A179,'Data CAO VVT 2019 (verbergen)'!C:M,11,0),\"NVT\")","v":60.02429610223642},{"$f":"IFERROR(VLOOKUP(A179,'Data CAO GGZ 2019 (verbergen)'!C:M,11,0),\"NVT\")","v":64.868549520766777}]
["75/9",{"$f":"IFERROR(VLOOKUP(A180,'Data CAO GHZ 2019 (verbergen)'!C:K,9,0),\"NVT\")","v":65.644468849840251},{"$f":"IFERROR(VLOOKUP(A180,'Data CAO VVT 2019 (verbergen)'!C:M,11,0),\"NVT\")","v":61.591310121405762},{"$f":"IFERROR(VLOOKUP(A180,'Data CAO GGZ 2019 (verbergen)'!C:M,11,0),\"NVT\")","v":65.698504792332258}]
["75/10",{"$f":"IFERROR(VLOOKUP(A181,'Data CAO GHZ 2019 (verbergen)'!C:K,9,0),\"NVT\")","v":67.40864616613419},{"$f":"IFERROR(VLOOKUP(A181,'Data CAO VVT 2019 (verbergen)'!C:M,11,0),\"NVT\")","v":63.219290734824277},{"$f":"IFERROR(VLOOKUP(A181,'Data CAO GGZ 2019 (verbergen)'!C:M,11,0),\"NVT\")","v":66.556753993610215}]
["75/11",{"$f":"IFERROR(VLOOKUP(A182,'Data CAO GHZ 2019 (verbergen)'!C:K,9,0),\"NVT\")","v":68.290734824281145},{"$f":"IFERROR(VLOOKUP(A182,'Data CAO VVT 2019 (verbergen)'!C:M,11,0),\"NVT\")","v":64.956263514377},{"$f":"IFERROR(VLOOKUP(A182,'Data CAO GGZ 2019 (verbergen)'!C:M,11,0),\"NVT\")","v":67.547041533546306}]
["75/12",{"$f":"IFERROR(VLOOKUP(A183,'Data CAO GHZ 2019 (verbergen)'!C:K,9,0),\"NVT\")","v":69.18230830670926},{"$f":"IFERROR(VLOOKUP(A183,'Data CAO VVT 2019 (verbergen)'!C:M,11,0),\"NVT\")","v":66.718159744408936},{"$f":"IFERROR(VLOOKUP(A183,'Data CAO GGZ 2019 (verbergen)'!C:M,11,0),\"NVT\")","v":68.556191693290742}]
["75/13",{"$f":"IFERROR(VLOOKUP(A184,'Data CAO GHZ 2019 (verbergen)'!C:K,9,0),\"NVT\")","v":70.206669329073478},{"$f":"IFERROR(VLOOKUP(A184,'Data CAO VVT 2019 (verbergen)'!C:M,11,0),\"NVT\")","v":67.568145265175716},{"$f":"IFERROR(VLOOKUP(A184,'Data CAO GGZ 2019 (verbergen)'!C:M,11,0),\"NVT\")","v":69.52761661341853}]
["75/14",{"$f":"IFERROR(VLOOKUP(A185,'Data CAO GHZ 2019 (verbergen)'!C:K,9,0),\"NVT\")","v":71.240515175718841},{"$f":"IFERROR(VLOOKUP(A185,'Data CAO VVT 2019 (verbergen)'!C:M,11,0),\"NVT\")","v":68.455036664536749},{"$f":"IFERROR(VLOOKUP(A185,'Data CAO GGZ 2019 (verbergen)'!C:M,11,0),\"NVT\")","v":70.536766773162938}]
["75/15",{"$f":"IFERROR(VLOOKUP(A186,'Data CAO GHZ 2019 (verbergen)'!C:K,9,0),\"NVT\")","v":72.264876198083073},{"$f":"IFERROR(VLOOKUP(A186,'Data CAO VVT 2019 (verbergen)'!C:M,11,0),\"NVT\")","v":69.475364383386577}]
["75/16",{"$f":"IFERROR(VLOOKUP(A187,'Data CAO GHZ 2019 (verbergen)'!C:K,9,0),\"NVT\")","v":73.308206869009581},{"$f":"IFERROR(VLOOKUP(A187,'Data CAO VVT 2019 (verbergen)'!C:M,11,0),\"NVT\")","v":70.50815382747605}]
["75/17",null,{"$f":"IFERROR(VLOOKUP(A188,'Data CAO VVT 2019 (verbergen)'!C:M,11,0),\"NVT\")","v":71.516211539936094}]
["75/18",null,{"$f":"IFERROR(VLOOKUP(A189,'Data CAO VVT 2019 (verbergen)'!C:M,11,0),\"NVT\")","v":72.548905124600651}]
["80/0",{"$f":"IFERROR(VLOOKUP(A190,'Data CAO GHZ 2019 (verbergen)'!C:K,9,0),\"NVT\")","v":55.913039137380188},{"$f":"IFERROR(VLOOKUP(A190,'Data CAO VVT 2019 (verbergen)'!C:M,11,0),\"NVT\")","v":56.902154632587859},{"$f":"IFERROR(VLOOKUP(A190,'Data CAO GGZ 2019 (verbergen)'!C:M,11,0),\"NVT\")","v":58.360945686900955}]
["80/1",{"$f":"IFERROR(VLOOKUP(A191,'Data CAO GHZ 2019 (verbergen)'!C:K,9,0),\"NVT\")","v":58.303214856230035},{"$f":"IFERROR(VLOOKUP(A191,'Data CAO VVT 2019 (verbergen)'!C:M,11,0),\"NVT\")","v":58.46907279233227},{"$f":"IFERROR(VLOOKUP(A191,'Data CAO GGZ 2019 (verbergen)'!C:M,11,0),\"NVT\")","v":60.633891373801916}]
["80/2",{"$f":"IFERROR(VLOOKUP(A192,'Data CAO GHZ 2019 (verbergen)'!C:K,9,0),\"NVT\")","v":60.664936102236425},{"$f":"IFERROR(VLOOKUP(A192,'Data CAO VVT 2019 (verbergen)'!C:M,11,0),\"NVT\")","v":60.02429610223642},{"$f":"IFERROR(VLOOKUP(A192,'Data CAO GGZ 2019 (verbergen)'!C:M,11,0),\"NVT\")","v":63.161482428115022}]
["80/3",{"$f":"IFERROR(VLOOKUP(A193,'Data CAO GHZ 2019 (verbergen)'!C:K,9,0),\"NVT\")","v":62.988718051118198},{"$f":"IFERROR(VLOOKUP(A193,'Data CAO VVT 2019 (verbergen)'!C:M,11,0),\"NVT\")","v":60.80162017891373},{"$f":"IFERROR(VLOOKUP(A193,'Data CAO GGZ 2019 (verbergen)'!C:M,11,0),\"NVT\")","v":65.698504792332258}]
["80/4",{"$f":"IFERROR(VLOOKUP(A194,'Data CAO GHZ 2019 (verbergen)'!C:K,9,0),\"NVT\")","v":65.644468849840251},{"$f":"IFERROR(VLOOKUP(A194,'Data CAO VVT 2019 (verbergen)'!C:M,11,0),\"NVT\")","v":61.591310121405762},{"$f":"IFERROR(VLOOKUP(A194,'Data CAO GGZ 2019 (verbergen)'!C:M,11,0),\"NVT\")","v":68.556191693290742}]
["80/5",{"$f":"IFERROR(VLOOKUP(A195,'Data CAO GHZ 2019 (verbergen)'!C:K,9,0),\"NVT\")","v":68.290734824281145},{"$f":"IFERROR(VLOOKUP(A195,'Data CAO VVT 2019 (verbergen)'!C:M,11,0),\"NVT\")","v":62.356555910543129},{"$f":"IFERROR(VLOOKUP(A195,'Data CAO GGZ 2019 (verbergen)'!C:M,11,0),\"NVT\")","v":70.536766773162938}]
["80/6",{"$f":"IFERROR(VLOOKUP(A196,'Data CAO GHZ 2019 (verbergen)'!C:K,9,0),\"NVT\")","v":71.240515175718841},{"$f":"IFERROR(VLOOKUP(A196,'Data CAO VVT 2019 (verbergen)'!C:M,11,0),\"NVT\")","v":64.956263514377},{"$f":"IFERROR(VLOOKUP(A196,'Data CAO GGZ 2019 (verbergen)'!C:M,11,0),\"NVT\")","v":72.507910543131004}]
["80/7",{"$f":"IFERROR(VLOOKUP(A197,'Data CAO GHZ 2019 (verbergen)'!C:K,9,0),\"NVT\")","v":73.308206869009581},{"$f":"IFERROR(VLOOKUP(A197,'Data CAO VVT 2019 (verbergen)'!C:M,11,0),\"NVT\")","v":67.568145265175716},{"$f":"IFERROR(VLOOKUP(A197,'Data CAO GGZ 2019 (verbergen)'!C:M,11,0),\"NVT\")","v":74.4884856230032}]
["80/8",{"$f":"IFERROR(VLOOKUP(A198,'Data CAO GHZ 2019 (verbergen)'!C:K,9,0),\"NVT\")","v":75.356928913738017},{"$f":"IFERROR(VLOOKUP(A198,'Data CAO VVT 2019 (verbergen)'!C:M,11,0),\"NVT\")","v":70.50815382747605},{"$f":"IFERROR(VLOOKUP(A198,'Data CAO GGZ 2019 (verbergen)'!C:M,11,0),\"NVT\")","v":76.487923322683699}]
["80/9",{"$f":"IFERROR(VLOOKUP(A199,'Data CAO GHZ 2019 (verbergen)'!C:K,9,0),\"NVT\")","v":77.405650958466452},{"$f":"IFERROR(VLOOKUP(A199,'Data CAO VVT 2019 (verbergen)'!C:M,11,0),\"NVT\")","v":72.548905124600651},{"$f":"IFERROR(VLOOKUP(A199,'Data CAO GGZ 2019 (verbergen)'!C:M,11,0),\"NVT\")","v":77.487642172523962}]
["80/10",{"$f":"IFERROR(VLOOKUP(A200,'Data CAO GHZ 2019 (verbergen)'!C:K,9,0),\"NVT\")","v":79.501797124600643},{"$f":"IFERROR(VLOOKUP(A200,'Data CAO VVT 2019 (verbergen)'!C:M,11,0),\"NVT\")","v":74.56549984664538},{"$f":"IFERROR(VLOOKUP(A200,'Data CAO GGZ 2019 (verbergen)'!C:M,11,0),\"NVT\")","v":78.487361022364212}]
["80/11",{"$f":"IFERROR(VLOOKUP(A201,'Data CAO GHZ 2019 (verbergen)'!C:K,9,0),\"NVT\")","v":80.52615814696486},{"$f":"IFERROR(VLOOKUP(A201,'Data CAO VVT 2019 (verbergen)'!C:M,11,0),\"NVT\")","v":76.606442862619815},{"$f":"IFERROR(VLOOKUP(A201,'Data CAO GGZ 2019 (verbergen)'!C:M,11,0),\"NVT\")","v":79.487079872204461}]
["80/12",{"$f":"IFERROR(VLOOKUP(A202,'Data CAO GHZ 2019 (verbergen)'!C:K,9,0),\"NVT\")","v":81.569488817891369},{"$f":"IFERROR(VLOOKUP(A202,'Data CAO VVT 2019 (verbergen)'!C:M,11,0),\"NVT\")","v":78.671925891373803},{"$f":"IFERROR(VLOOKUP(A202,'Data CAO GGZ 2019 (verbergen)'!C:M,11,0),\"NVT\")","v":80.477367412140566}]
["80/13",{"$f":"IFERROR(VLOOKUP(A203,'Data CAO GHZ 2019 (verbergen)'!C:K,9,0),\"NVT\")","v":82.603334664536746},{"$f":"IFERROR(VLOOKUP(A203,'Data CAO VVT 2019 (verbergen)'!C:M,11,0),\"NVT\")","v":79.692253610223659},{"$f":"IFERROR(VLOOKUP(A203,'Data CAO GGZ 2019 (verbergen)'!C:M,11,0),\"NVT\")","v":81.486517571884988}]
["80/14",{"$f":"IFERROR(VLOOKUP(A204,'Data CAO GHZ 2019 (verbergen)'!C:K,9,0),\"NVT\")","v":83.627695686900964},{"$f":"IFERROR(VLOOKUP(A204,'Data CAO VVT 2019 (verbergen)'!C:M,11,0),\"NVT\")","v":80.724851335463242},{"$f":"IFERROR(VLOOKUP(A204,'Data CAO GGZ 2019 (verbergen)'!C:M,11,0),\"NVT\")","v":82.476805111821108}]
["80/15",{"$f":"IFERROR(VLOOKUP(A205,'Data CAO GHZ 2019 (verbergen)'!C:K,9,0),\"NVT\")","v":84.689996006389777},{"$f":"IFERROR(VLOOKUP(A205,'Data CAO VVT 2019 (verbergen)'!C:M,11,0),\"NVT\")","v":81.745179054313112}]
["80/16",{"$f":"IFERROR(VLOOKUP(A206,'Data CAO GHZ 2019 (verbergen)'!C:K,9,0),\"NVT\")","v":85.723841853035154},{"$f":"IFERROR(VLOOKUP(A206,'Data CAO VVT 2019 (verbergen)'!C:M,11,0),\"NVT\")","v":82.765602632587857}]
["80/17",null,{"$f":"IFERROR(VLOOKUP(A207,'Data CAO VVT 2019 (verbergen)'!C:M,11,0),\"NVT\")","v":83.81008692651757}]
["80/18",null,{"$f":"IFERROR(VLOOKUP(A208,'Data CAO VVT 2019 (verbergen)'!C:M,11,0),\"NVT\")","v":84.830702223642163}]

{"sheet":"Data CAO GHZ 2019 (verbergen)","index":14,"n_rows":212,"n_cols":11,"rows_kept":212,"cut":false,"hidden":true,"merged":[]}
["Cao GHZ schalen per 1-1-2019"]
[null,null,null,null,7.0499999999999993E-2,0.08,3.6999999999999998E-2,null,{"$f":"17%+8%","v":0.25},null,{"$f":"1878/12","v":156.5}]
["Funct.schaal","Trede","Samengesteld","Salaris","EJU","Vak toeslag","PBL","Brutoloon","Soc.lasten + pens.pr.","Tot incl soc lst + pens.pr.","Uurloon"]
[5,0,{"$f":"CONCATENATE(A4,\"/\",B4)","v":"5/0"},1501,{"$f":"D4*$E$2","v":105.8205},{"$f":"D4*$F$2","v":120.08},{"$f":"D4*$G$2","v":55.536999999999999},{"$f":"SUM(D4:G4)","v":1782.4375},{"$f":"H4*$I$2","v":445.609375},{"$f":"SUM(H4:I4)","v":2228.046875},{"$f":"J4/$K$2","v":14.23672124600639}]
[5,1,"5/1",1528,107.72399999999999,122.24000000000001,56.535999999999994,1814.5,453.625,2268.125,14.492811501597444]
[5,2,"5/2",1556,109.69799999999999,124.48,57.571999999999996,1847.75,461.9375,2309.6875,14.758386581469649]
[5,3,"5/3",1616,113.92799999999998,129.28,59.791999999999994,1918.9999999999998,479.74999999999994,2398.7499999999995,15.327476038338656]
[5,4,"5/4",1676,118.15799999999999,134.08000000000001,62.012,1990.2499999999998,497.56249999999994,2487.8124999999995,15.896565495207664]
[5,5,"5/5",1707,120.34349999999999,136.56,63.158999999999999,2027.0625,506.765625,2533.828125,16.190595047923324]
[5,6,"5/6",1755,123.72749999999999,140.4,64.935000000000002,2084.0625,521.015625,2605.078125,16.64586661341853]
[5,7,"5/7",1800,126.89999999999999,144,66.599999999999994,2137.5,534.375,2671.875,17.072683706070286]
[5,8,"5/8",1846,130.143,147.68,68.301999999999992,2192.125,548.03125,2740.15625,17.508985623003195]
[5,9,"5/9",1898,133.809,151.84,70.225999999999999,2253.875,563.46875,2817.34375,18.002196485623003]
[10,0,"10/0",1528,107.72399999999999,122.24000000000001,56.535999999999994,1814.5,453.625,2268.125,14.492811501597444]
[10,1,"10/1",1556,109.69799999999999,124.48,57.571999999999996,1847.75,461.9375,2309.6875,14.758386581469649]
[10,2,"10/2",1616,113.92799999999998,129.28,59.791999999999994,1918.9999999999998,479.74999999999994,2398.7499999999995,15.327476038338656]
[10,3,"10/3",1676,118.15799999999999,134.08000000000001,62.012,1990.2499999999998,497.56249999999994,2487.8124999999995,15.896565495207664]
[10,4,"10/4",1707,120.34349999999999,136.56,63.158999999999999,2027.0625,506.765625,2533.828125,16.190595047923324]
[10,5,"10/5",1755,123.72749999999999,140.4,64.935000000000002,2084.0625,521.015625,2605.078125,16.64586661341853]
[10,6,"10/6",1800,126.89999999999999,144,66.599999999999994,2137.5,534.375,2671.875,17.072683706070286]
[10,7,"10/7",1846,130.143,147.68,68.301999999999992,2192.125,548.03125,2740.15625,17.508985623003195]
[10,8,"10/8",1898,133.809,151.84,70.225999999999999,2253.875,563.46875,2817.34375,18.002196485623003]
[10,9,"10/9",1956,137.898,156.47999999999999,72.372,2322.75,580.6875,2903.4375,18.552316293929714]
[10,10,"10/10",2016,142.12799999999999,161.28,74.591999999999999,2394.0000000000005,598.50000000000011,2992.5000000000005,19.121405750798726]
[15,0,"15/0",1556,109.69799999999999,124.48,57.571999999999996,1847.75,461.9375,2309.6875,14.758386581469649]
[15,1,"15/1",1616,113.92799999999998,129.28,59.791999999999994,1918.9999999999998,479.74999999999994,2398.7499999999995,15.327476038338656]
[15,2,"15/2",1676,118.15799999999999,134.08000000000001,62.012,1990.2499999999998,497.56249999999994,2487.8124999999995,15.896565495207664]
[15,3,"15/3",1707,120.34349999999999,136.56,63.158999999999999,2027.0625,506.765625,2533.828125,16.190595047923324]
[15,4,"15/4",1755,123.72749999999999,140.4,64.935000000000002,2084.0625,521.015625,2605.078125,16.64586661341853]
[15,5,"15/5",1800,126.89999999999999,144,66.599999999999994,2137.5,534.375,2671.875,17.072683706070286]
[15,6,"15/6",1846,130.143,147.68,68.301999999999992,2192.125,548.03125,2740.15625,17.508985623003195]
[15,7,"15/7",1898,133.809,151.84,70.225999999999999,2253.875,563.46875,2817.34375,18.002196485623003]
[15,8,"15/8",1956,137.898,156.47999999999999,72.372,2322.75,580.6875,2903.4375,18.552316293929714]
[15,9,"15/9",2016,142.12799999999999,161.28,74.591999999999999,2394.0000000000005,598.50000000000011,2992.5000000000005,19.121405750798726]
[15,10,"15/10",2083,146.85149999999999,166.64000000000001,77.070999999999998,2473.5624999999995,618.39062499999989,3091.9531249999995,19.756888977635779]
[15,11,"15/11",2153,151.78649999999999,172.24,79.661000000000001,2556.6875,639.171875,3195.859375,20.420826677316295]
[20,0,"20/0",1616,113.92799999999998,129.28,59.791999999999994,1918.9999999999998,479.74999999999994,2398.7499999999995,15.327476038338656]
[20,1,"20/1",1707,120.34349999999999,136.56,63.158999999999999,2027.0625,506.765625,2533.828125,16.190595047923324]
[20,2,"20/2",1755,123.72749999999999,140.4,64.935000000000002,2084.0625,521.015625,2605.078125,16.64586661341853]
[20,3,"20/3",1800,126.89999999999999,144,66.599999999999994,2137.5,534.375,2671.875,17.072683706070286]
[20,4,"20/4",1846,130.143,147.68,68.301999999999992,2192.125,548.03125,2740.15625,17.508985623003195]
[20,5,"20/5",1898,133.809,151.84,70.225999999999999,2253.875,563.46875,2817.34375,18.002196485623003]
[20,6,"20/6",1956,137.898,156.47999999999999,72.372,2322.75,580.6875,2903.4375,18.552316293929714]
[20,7,"20/7",2016,142.12799999999999,161.28,74.591999999999999,2394.0000000000005,598.50000000000011,2992.5000000000005,19.121405750798726]
[20,8,"20/8",2083,146.85149999999999,166.64000000000001,77.070999999999998,2473.5624999999995,618.39062499999989,3091.9531249999995,19.756888977635779]
[20,9,"20/9",2153,151.78649999999999,172.24,79.661000000000001,2556.6875,639.171875,3195.859375,20.420826677316295]
[20,10,"20/10",2216,156.22799999999998,177.28,81.99199999999999,2631.5000000000005,657.87500000000011,3289.3750000000005,21.018370607028757]
[20,11,"20/11",2287,161.23349999999999,182.96,84.619,2715.8125,678.953125,3394.765625,21.691793130990416]
[25,0,"25/0",1676,118.15799999999999,134.08000000000001,62.012,1990.2499999999998,497.56249999999994,2487.8124999999995,15.896565495207664]
[25,1,"25/1",1755,123.72749999999999,140.4,64.935000000000002,2084.0625,521.015625,2605.078125,16.64586661341853]
[25,2,"25/2",1846,130.143,147.68,68.301999999999992,2192.125,548.03125,2740.15625,17.508985623003195]
[25,3,"25/3",1898,133.809,151.84,70.225999999999999,2253.875,563.46875,2817.34375,18.002196485623003]
[25,4,"25/4",1956,137.898,156.47999999999999,72.372,2322.75,580.6875,2903.4375,18.552316293929714]
[25,5,"25/5",2016,142.12799999999999,161.28,74.591999999999999,2394.0000000000005,598.50000000000011,2992.5000000000005,19.121405750798726]
[25,6,"25/6",2083,146.85149999999999,166.64000000000001,77.070999999999998,2473.5624999999995,618.39062499999989,3091.9531249999995,19.756888977635779]
[25,7,"25/7",2153,151.78649999999999,172.24,79.661000000000001,2556.6875,639.171875,3195.859375,20.420826677316295]
[25,8,"25/8",2216,156.22799999999998,177.28,81.99199999999999,2631.5000000000005,657.87500000000011,3289.3750000000005,21.018370607028757]
[25,9,"25/9",2287,161.23349999999999,182.96,84.619,2715.8125,678.953125,3394.765625,21.691793130990416]
[25,10,"25/10",2345,165.32249999999999,187.6,86.765000000000001,2784.6875,696.171875,3480.859375,22.241912939297123]
[25,11,"25/11",2413,170.11649999999997,193.04,89.280999999999992,2865.4375,716.359375,3581.796875,22.886880990415335]
[30,0,"30/0",1707,120.34349999999999,136.56,63.158999999999999,2027.0625,506.765625,2533.828125,16.190595047923324]
[30,1,"30/1",1800,126.89999999999999,144,66.599999999999994,2137.5,534.375,2671.875,17.072683706070286]
[30,2,"30/2",1898,133.809,151.84,70.225999999999999,2253.875,563.46875,2817.34375,18.002196485623003]
[30,3,"30/3",2016,142.12799999999999,161.28,74.591999999999999,2394.0000000000005,598.50000000000011,2992.5000000000005,19.121405750798726]
[30,4,"30/4",2083,146.85149999999999,166.64000000000001,77.070999999999998,2473.5624999999995,618.39062499999989,3091.9531249999995,19.756888977635779]
[30,5,"30/5",2153,151.78649999999999,172.24,79.661000000000001,2556.6875,639.171875,3195.859375,20.420826677316295]
[30,6,"30/6",2216,156.22799999999998,177.28,81.99199999999999,2631.5000000000005,657.87500000000011,3289.3750000000005,21.018370607028757]
[30,7,"30/7",2287,161.23349999999999,182.96,84.619,2715.8125,678.953125,3394.765625,21.691793130990416]
[30,8,"30/8",2345,165.32249999999999,187.6,86.765000000000001,2784.6875,696.171875,3480.859375,22.241912939297123]
[30,9,"30/9",2413,170.11649999999997,193.04,89.280999999999992,2865.4375,716.359375,3581.796875,22.886880990415335]
[30,10,"30/10",2478,174.69899999999998,198.24,91.685999999999993,2942.6250000000005,735.65625000000011,3678.2812500000005,23.503394568690098]
[30,11,"30/11",2546,179.49299999999999,203.68,94.201999999999998,3023.375,755.84375,3779.21875,24.148362619808307]
[35,0,"35/0",1800,126.89999999999999,144,66.599999999999994,2137.5,534.375,2671.875,17.072683706070286]
[35,1,"35/1",1898,133.809,151.84,70.225999999999999,2253.875,563.46875,2817.34375,18.002196485623003]
[35,2,"35/2",2016,142.12799999999999,161.28,74.591999999999999,2394.0000000000005,598.50000000000011,2992.5000000000005,19.121405750798726]
[35,3,"35/3",2153,151.78649999999999,172.24,79.661000000000001,2556.6875,639.171875,3195.859375,20.420826677316295]
[35,4,"35/4",2216,156.22799999999998,177.28,81.99199999999999,2631.5000000000005,657.87500000000011,3289.3750000000005,21.018370607028757]
[35,5,"35/5",2287,161.23349999999999,182.96,84.619,2715.8125,678.953125,3394.765625,21.691793130990416]
[35,6,"35/6",2345,165.32249999999999,187.6,86.765000000000001,2784.6875,696.171875,3480.859375,22.241912939297123]
[35,7,"35/7",2413,170.11649999999997,193.04,89.280999999999992,2865.4375,716.359375,3581.796875,22.886880990415335]
[35,8,"35/8",2478,174.69899999999998,198.24,91.685999999999993,2942.6250000000005,735.65625000000011,3678.2812500000005,23.503394568690098]
[35,9,"35/9",2546,179.49299999999999,203.68,94.201999999999998,3023.375,755.84375,3779.21875,24.148362619808307]
[35,10,"35/10",2610,184.005,208.8,96.57,3099.3750000000005,774.84375000000011,3874.2187500000005,24.75539137380192]
[35,11,"35/11",2675,188.58749999999998,214,98.974999999999994,3176.5625,794.140625,3970.703125,25.371904952076676]
[40,0,"40/0",1898,133.809,151.84,70.225999999999999,2253.875,563.46875,2817.34375,18.002196485623003]
[40,1,"40/1",2016,142.12799999999999,161.28,74.591999999999999,2394.0000000000005,598.50000000000011,2992.5000000000005,19.121405750798726]
[40,2,"40/2",2153,151.78649999999999,172.24,79.661000000000001,2556.6875,639.171875,3195.859375,20.420826677316295]
[40,3,"40/3",2287,161.23349999999999,182.96,84.619,2715.8125,678.953125,3394.765625,21.691793130990416]
[40,4,"40/4",2345,165.32249999999999,187.6,86.765000000000001,2784.6875,696.171875,3480.859375,22.241912939297123]
[40,5,"40/5",2413,170.11649999999997,193.04,89.280999999999992,2865.4375,716.359375,3581.796875,22.886880990415335]
[40,6,"40/6",2478,174.69899999999998,198.24,91.685999999999993,2942.6250000000005,735.65625000000011,3678.2812500000005,23.503394568690098]
[40,7,"40/7",2546,179.49299999999999,203.68,94.201999999999998,3023.375,755.84375,3779.21875,24.148362619808307]
[40,8,"40/8",2610,184.005,208.8,96.57,3099.3750000000005,774.84375000000011,3874.2187500000005,24.75539137380192]
[40,9,"40/9",2675,188.58749999999998,214,98.974999999999994,3176.5625,794.140625,3970.703125,25.371904952076676]
[40,10,"40/10",2742,193.31099999999998,219.36,101.45399999999999,3256.1250000000005,814.03125000000011,4070.1562500000005,26.00738817891374]
[40,11,"40/11",2807,197.89349999999999,224.56,103.85899999999999,3333.3125,833.328125,4166.640625,26.623901757188499]
[45,0,"45/0",2016,142.12799999999999,161.28,74.591999999999999,2394.0000000000005,598.50000000000011,2992.5000000000005,19.121405750798726]
[45,1,"45/1",2153,151.78649999999999,172.24,79.661000000000001,2556.6875,639.171875,3195.859375,20.420826677316295]
[45,2,"45/2",2287,161.23349999999999,182.96,84.619,2715.8125,678.953125,3394.765625,21.691793130990416]
[45,3,"45/3",2413,170.11649999999997,193.04,89.280999999999992,2865.4375,716.359375,3581.796875,22.886880990415335]
[45,4,"45/4",2546,179.49299999999999,203.68,94.201999999999998,3023.375,755.84375,3779.21875,24.148362619808307]
[45,5,"45/5",2610,184.005,208.8,96.57,3099.3750000000005,774.84375000000011,3874.2187500000005,24.75539137380192]
[45,6,"45/6",2675,188.58749999999998,214,98.974999999999994,3176.5625,794.140625,3970.703125,25.371904952076676]
[45,7,"45/7",2742,193.31099999999998,219.36,101.45399999999999,3256.1250000000005,814.03125000000011,4070.1562500000005,26.00738817891374]
[45,8,"45/8",2807,197.89349999999999,224.56,103.85899999999999,3333.3125,833.328125,4166.640625,26.623901757188499]
[45,9,"45/9",2877,202.82849999999999,230.16,106.449,3416.4375,854.109375,4270.546875,27.287839456869008]
[45,10,"45/10",2948,207.83399999999997,235.84,109.07599999999999,3500.75,875.1875,4375.9375,27.96126198083067]
[45,11,"45/11",3021,212.98049999999998,241.68,111.777,3587.4375,896.859375,4484.296875,28.653654153354633]
[45,12,"45/12",3084,217.42199999999997,246.72,114.10799999999999,3662.25,915.5625,4577.8125,29.251198083067091]
[50,0,"50/0",2345,165.32249999999999,187.6,86.765000000000001,2784.6875,696.171875,3480.859375,22.241912939297123]
[50,1,"50/1",2478,174.69899999999998,198.24,91.685999999999993,2942.6250000000005,735.65625000000011,3678.2812500000005,23.503394568690098]
[50,2,"50/2",2610,184.005,208.8,96.57,3099.3750000000005,774.84375000000011,3874.2187500000005,24.75539137380192]
[50,3,"50/3",2742,193.31099999999998,219.36,101.45399999999999,3256.1250000000005,814.03125000000011,4070.1562500000005,26.00738817891374]
[50,4,"50/4",2877,202.82849999999999,230.16,106.449,3416.4375,854.109375,4270.546875,27.287839456869008]
[50,5,"50/5",3021,212.98049999999998,241.68,111.777,3587.4375,896.859375,4484.296875,28.653654153354633]
[50,6,"50/6",3084,217.42199999999997,246.72,114.10799999999999,3662.25,915.5625,4577.8125,29.251198083067091]
[50,7,"50/7",3157,222.56849999999997,252.56,116.809,3748.9375,937.234375,4686.171875,29.943590255591054]
[50,8,"50/8",3227,227.50349999999997,258.16000000000003,119.399,3832.0624999999995,958.01562499999989,4790.0781249999991,30.607527955271561]
[50,9,"50/9",3294,232.22699999999998,263.52,121.878,3911.625,977.90625,4889.53125,31.243011182108628]
[50,10,"50/10",3364,237.16199999999998,269.12,124.46799999999999,3994.7499999999995,998.68749999999989,4993.4374999999991,31.90694888178913]
[50,11,"50/11",3432,241.95599999999999,274.56,126.98399999999999,4075.5,1018.875,5094.375,32.551916932907346]
[50,12,"50/12",3505,247.10249999999996,280.40000000000003,129.685,4162.1875,1040.546875,5202.734375,33.244309105431313]
[55,0,"55/0",2675,188.58749999999998,214,98.974999999999994,3176.5625,794.140625,3970.703125,25.371904952076676]
[55,1,"55/1",2807,197.89349999999999,224.56,103.85899999999999,3333.3125,833.328125,4166.640625,26.623901757188499]
[55,2,"55/2",2948,207.83399999999997,235.84,109.07599999999999,3500.75,875.1875,4375.9375,27.96126198083067]
[55,3,"55/3",3084,217.42199999999997,246.72,114.10799999999999,3662.25,915.5625,4577.8125,29.251198083067091]
[55,4,"55/4",3227,227.50349999999997,258.16000000000003,119.399,3832.0624999999995,958.01562499999989,4790.0781249999991,30.607527955271561]
[55,5,"55/5",3364,237.16199999999998,269.12,124.46799999999999,3994.7499999999995,998.68749999999989,4993.4374999999991,31.90694888178913]
[55,6,"55/6",3505,247.10249999999996,280.40000000000003,129.685,4162.1875,1040.546875,5202.734375,33.244309105431313]
[55,7,"55/7",3572,251.82599999999996,285.76,132.16399999999999,4241.75,1060.4375,5302.1875,33.879792332268373]
[55,8,"55/8",3650,257.32499999999999,292,135.04999999999998,4334.375,1083.59375,5417.96875,34.61960862619808]
[55,9,"55/9",3728,262.82399999999996,298.24,137.93600000000001,4427,1106.75,5533.75,35.359424920127793]
[55,10,"55/10",3806,268.32299999999998,304.48,140.822,4519.625,1129.90625,5649.53125,36.099241214057507]
[55,11,"55/11",3879,273.46949999999998,310.32,143.523,4606.3125,1151.578125,5757.890625,36.791633386581466]
[55,12,"55/12",3948,278.33399999999995,315.84000000000003,146.07599999999999,4688.25,1172.0625,5860.3125,37.446086261980831]
[60,0,"60/0",3084,217.42199999999997,246.72,114.10799999999999,3662.25,915.5625,4577.8125,29.251198083067091]
[60,1,"60/1",3227,227.50349999999997,258.16000000000003,119.399,3832.0624999999995,958.01562499999989,4790.0781249999991,30.607527955271561]
[60,2,"60/2",3364,237.16199999999998,269.12,124.46799999999999,3994.7499999999995,998.68749999999989,4993.4374999999991,31.90694888178913]
[60,3,"60/3",3505,247.10249999999996,280.40000000000003,129.685,4162.1875,1040.546875,5202.734375,33.244309105431313]
[60,4,"60/4",3650,257.32499999999999,292,135.04999999999998,4334.375,1083.59375,5417.96875,34.61960862619808]
[60,5,"60/5",3806,268.32299999999998,304.48,140.822,4519.625,1129.90625,5649.53125,36.099241214057507]
[60,6,"60/6",3948,278.33399999999995,315.84000000000003,146.07599999999999,4688.25,1172.0625,5860.3125,37.446086261980831]
[60,7,"60/7",4096,288.76799999999997,327.68,151.55199999999999,4864,1216,6080,38.849840255591054]
[60,8,"60/8",4243,299.13149999999996,339.44,156.99099999999999,5038.5624999999991,1259.6406249999998,6298.2031249999991,40.244109424920119]
[60,9,"60/9",4303,303.36149999999998,344.24,159.21099999999998,5109.8125,1277.453125,6387.265625,40.813198881789134]
[60,10,"60/10",4369,308.0145,349.52,161.65299999999999,5188.1875,1297.046875,6485.234375,41.439197284345049]
[60,11,"60/11",4436,312.73799999999994,354.88,164.13200000000001,5267.75,1316.9375,6584.6875,42.074680511182109]
[60,12,"60/12",4499,317.17949999999996,359.92,166.46299999999999,5342.5625,1335.640625,6678.203125,42.672224440894567]
[65,0,"65/0",3505,247.10249999999996,280.40000000000003,129.685,4162.1875,1040.546875,5202.734375,33.244309105431313]
[65,1,"65/1",3728,262.82399999999996,298.24,137.93600000000001,4427,1106.75,5533.75,35.359424920127793]
[65,2,"65/2",3948,278.33399999999995,315.84000000000003,146.07599999999999,4688.25,1172.0625,5860.3125,37.446086261980831]
[65,3,"65/3",4096,288.76799999999997,327.68,151.55199999999999,4864,1216,6080,38.849840255591054]
[65,4,"65/4",4243,299.13149999999996,339.44,156.99099999999999,5038.5624999999991,1259.6406249999998,6298.2031249999991,40.244109424920119]
[65,5,"65/5",4369,308.0145,349.52,161.65299999999999,5188.1875,1297.046875,6485.234375,41.439197284345049]
[65,6,"65/6",4499,317.17949999999996,359.92,166.46299999999999,5342.5625,1335.640625,6678.203125,42.672224440894567]
[65,7,"65/7",4635,326.76749999999998,370.8,171.495,5504.0625,1376.015625,6880.078125,43.962160543130992]
[65,8,"65/8",4768,336.14399999999995,381.44,176.416,5662,1415.5,7077.5,45.223642172523959]
[65,9,"65/9",4898,345.30899999999997,391.84000000000003,181.226,5816.375,1454.09375,7270.46875,46.456669329073485]
[65,10,"65/10",5034,354.89699999999999,402.72,186.25799999999998,5977.875,1494.46875,7472.34375,47.746605431309902]
[65,11,"65/11",5097,359.33849999999995,407.76,188.589,6052.6875,1513.171875,7565.859375,48.344149361022367]
[65,12,"65/12",5166,364.20299999999997,413.28000000000003,191.142,6134.6249999999991,1533.6562499999998,7668.2812499999991,48.998602236421718]
[65,13,"65/13",5231,368.78549999999996,418.48,193.547,6211.8124999999991,1552.9531249999998,7764.7656249999991,49.61511581469648]
[65,14,"65/14",5296,373.36799999999994,423.68,195.952,6289.0000000000009,1572.2500000000002,7861.2500000000009,50.23162939297125]
[70,0,"70/0",4243,299.13149999999996,339.44,156.99099999999999,5038.5624999999991,1259.6406249999998,6298.2031249999991,40.244109424920119]
[70,1,"70/1",4436,312.73799999999994,354.88,164.13200000000001,5267.75,1316.9375,6584.6875,42.074680511182109]
[70,2,"70/2",4635,326.76749999999998,370.8,171.495,5504.0625,1376.015625,6880.078125,43.962160543130992]
[70,3,"70/3",4833,340.72649999999999,386.64,178.821,5739.1875,1434.796875,7173.984375,45.840155750798722]
[70,4,"70/4",5034,354.89699999999999,402.72,186.25799999999998,5977.875,1494.46875,7472.34375,47.746605431309902]
[70,5,"70/5",5231,368.78549999999996,418.48,193.547,6211.8124999999991,1552.9531249999998,7764.7656249999991,49.61511581469648]
[70,6,"70/6",5430,382.81499999999994,434.40000000000003,200.91,6448.1249999999991,1612.0312499999998,8060.1562499999991,51.502595846645363]
[70,7,"70/7",5564,392.26199999999994,445.12,205.86799999999999,6607.25,1651.8125,8259.0625,52.77356230031949]
[70,8,"70/8",5731,404.03549999999996,458.48,212.047,6805.5624999999991,1701.3906249999998,8506.9531249999982,54.357527955271557]
[70,9,"70/9",5895,415.59749999999997,471.6,218.11499999999998,7000.3125,1750.078125,8750.390625,55.913039137380188]
[70,10,"70/10",6061,427.30049999999994,484.88,224.25699999999998,7197.4375,1799.359375,8996.796875,57.487519968051117]
[70,11,"70/11",6147,433.36349999999993,491.76,227.43899999999999,7299.5625,1824.890625,9124.453125,58.303214856230035]
[70,12,"70/12",6229,439.14449999999994,498.32,230.47299999999998,7396.9375,1849.234375,9246.171875,59.080970447284344]
[70,13,"70/13",6311,444.92549999999994,504.88,233.50699999999998,7494.3125,1873.578125,9367.890625,59.858726038338659]
[70,14,"70/14",6396,450.91799999999995,511.68,236.65199999999999,7595.25,1898.8125,9494.0625,60.664936102236425]
[75,0,"75/0",5034,354.89699999999999,402.72,186.25799999999998,5977.875,1494.46875,7472.34375,47.746605431309902]
[75,1,"75/1",5231,368.78549999999996,418.48,193.547,6211.8124999999991,1552.9531249999998,7764.7656249999991,49.61511581469648]
[75,2,"75/2",5430,382.81499999999994,434.40000000000003,200.91,6448.1249999999991,1612.0312499999998,8060.1562499999991,51.502595846645363]
[75,3,"75/3",5647,398.11349999999999,451.76,208.93899999999999,6705.8125000000009,1676.4531250000002,8382.2656250000018,53.560802715654965]
[75,4,"75/4",5895,415.59749999999997,471.6,218.11499999999998,7000.3125,1750.078125,8750.390625,55.913039137380188]
[75,5,"75/5",6147,433.36349999999993,491.76,227.43899999999999,7299.5625,1824.890625,9124.453125,58.303214856230035]
[75,6,"75/6",6396,450.91799999999995,511.68,236.65199999999999,7595.25,1898.8125,9494.0625,60.664936102236425]
[75,7,"75/7",6560,462.47999999999996,524.79999999999995,242.72,7790,1947.5,9737.5,62.220447284345049]
[75,8,"75/8",6736,474.88799999999998,538.88,249.232,7999,1999.75,9998.75,63.889776357827479]
[75,9,"75/9",6921,487.93049999999994,553.68000000000006,256.077,8218.6875,2054.671875,10273.359375,65.644468849840251]
[75,10,"75/10",7107,501.04349999999994,568.56000000000006,262.959,8439.5625,2109.890625,10549.453125,67.40864616613419]
[75,11,"75/11",7200,507.59999999999997,576,266.39999999999998,8550,2137.5,10687.5,68.290734824281145]
[75,12,"75/12",7294,514.22699999999998,583.52,269.87799999999999,8661.625,2165.40625,10827.03125,69.18230830670926]
[75,13,"75/13",7402,521.84099999999989,592.16,273.87399999999997,8789.875,2197.46875,10987.34375,70.206669329073478]
[75,14,"75/14",7511,529.52549999999997,600.88,277.90699999999998,8919.3124999999982,2229.8281249999995,11149.140624999998,71.240515175718841]
[75,15,"75/15",7619,537.1395,609.52,281.90299999999996,9047.5625,2261.890625,11309.453125,72.264876198083073]
[75,16,"75/16",7729,544.89449999999999,618.32000000000005,285.97300000000001,9178.1875,2294.546875,11472.734375,73.308206869009581]
[80,0,"80/0",5895,415.59749999999997,471.6,218.11499999999998,7000.3125,1750.078125,8750.390625,55.913039137380188]
[80,1,"80/1",6147,433.36349999999993,491.76,227.43899999999999,7299.5625,1824.890625,9124.453125,58.303214856230035]
[80,2,"80/2",6396,450.91799999999995,511.68,236.65199999999999,7595.25,1898.8125,9494.0625,60.664936102236425]
[80,3,"80/3",6641,468.19049999999993,531.28,245.71699999999998,7886.1874999999991,1971.5468749999998,9857.7343749999982,62.988718051118198]
[80,4,"80/4",6921,487.93049999999994,553.68000000000006,256.077,8218.6875,2054.671875,10273.359375,65.644468849840251]
[80,5,"80/5",7200,507.59999999999997,576,266.39999999999998,8550,2137.5,10687.5,68.290734824281145]
[80,6,"80/6",7511,529.52549999999997,600.88,277.90699999999998,8919.3124999999982,2229.8281249999995,11149.140624999998,71.240515175718841]
[80,7,"80/7",7729,544.89449999999999,618.32000000000005,285.97300000000001,9178.1875,2294.546875,11472.734375,73.308206869009581]
[80,8,"80/8",7945,560.12249999999995,635.6,293.96499999999997,9434.6875,2358.671875,11793.359375,75.356928913738017]
[80,9,"80/9",8161,575.3504999999999,652.88,301.95699999999999,9691.1875,2422.796875,12113.984375,77.405650958466452]
[80,10,"80/10",8382,590.93099999999993,670.56000000000006,310.13399999999996,9953.625,2488.40625,12442.03125,79.501797124600643]
[80,11,"80/11",8490,598.54499999999996,679.2,314.13,10081.875,2520.46875,12602.34375,80.52615814696486]
[80,12,"80/12",8600,606.29999999999995,688,318.2,10212.5,2553.125,12765.625,81.569488817891369]
[80,13,"80/13",8709,613.98449999999991,696.72,322.233,10341.9375,2585.484375,12927.421875,82.603334664536746]
[80,14,"80/14",8817,621.59849999999994,705.36,326.22899999999998,10470.1875,2617.546875,13087.734375,83.627695686900964]
[80,15,"80/15",8929,629.4944999999999,714.32,330.37299999999999,10603.1875,2650.796875,13253.984375,84.689996006389777]
[80,16,"80/16",9038,637.17899999999997,723.04,334.40600000000001,10732.625000000002,2683.1562500000005,13415.781250000002,85.723841853035154]

{"sheet":"Data CAO VVT 2019 (verbergen)","index":15,"n_rows":183,"n_cols":13,"rows_kept":183,"cut":false,"hidden":true,"merged":[]}
["Cao VVT schalen per 1-1-2019"]
[null,null,null,null,0.04,null,7.3999999999999996E-2,0.08,null,null,{"$f":"17%+8%","v":0.25},null,{"$f":"1878/12","v":156.5}]
["Funct.schaal","Trede","Samengesteld","Salaris","Verhoging","Nieuw salaris","EJU","Vak toeslag","PBL","Brutoloon","Soc.lasten + pens.pr.","Tot incl soc lst + pens.pr.","Uurloon"]
[10,0,{"$f":"CONCATENATE(A4,\"/\",B4)","v":"10/0"},1475.14,{"$f":"D4*$E$2","v":59.005600000000008},{"$f":"D4+E4","v":1534.1456000000001},{"$f":"F4*$G$2","v":113.52677439999999},{"$f":"F4*$H$2","v":122.73164800000001},{"$f":"D4*$I$2","v":0},{"$f":"SUM(F4:I4)","v":1770.4040224},{"$f":"J4*$K$2","v":442.60100560000001},{"$f":"SUM(J4:K4)","v":2213.005028},{"$f":"L4/$M$2","v":14.140607207667731}]
[10,1,"10/1",1503.01,60.120400000000004,1563.1304,115.67164959999999,125.050432,0,1803.8524815999999,450.96312039999998,2254.8156019999997,14.407767424920126]
[10,2,"10/2",1530.87,61.2348,1592.1047999999998,117.81575519999998,127.36838399999999,0,1837.2889391999997,459.32223479999993,2296.6111739999997,14.674831782747601]
[10,3,"10/3",1590.46,63.618400000000001,1654.0784000000001,122.4018016,132.32627200000002,0,1908.8064736000001,477.20161840000003,2386.008092,15.246058095846646]
[10,4,"10/4",1648.73,65.949200000000005,1714.6792,126.8862608,137.17433600000001,0,1978.7397968,494.68494920000001,2473.4247460000001,15.804630964856232]
[15,0,"15/0",1648.73,65.949200000000005,1714.6792,126.8862608,137.17433600000001,0,1978.7397968,494.68494920000001,2473.4247460000001,15.804630964856232]
[15,1,"15/1",1680.44,67.217600000000004,1747.6576,129.3266624,139.81260800000001,0,2016.7968704,504.1992176,2520.9960879999999,16.108601201277953]
[15,2,"15/2",1724.78,68.991200000000006,1793.7711999999999,132.73906879999998,143.50169600000001,0,2070.0119648,517.5029912,2587.514956,16.533641891373801]
[15,3,"15/3",1767.87,70.714799999999997,1838.5847999999999,136.05527519999998,147.08678399999999,0,2121.7268592,530.43171480000001,2652.158574,16.946700153354634]
[15,4,"15/4",1814.76,72.590400000000002,1887.3504,139.66392959999999,150.988032,0,2178.0023616000003,544.50059040000008,2722.5029520000003,17.396184996805115]
[15,5,"15/5",1865.45,74.618000000000009,1940.068,143.565032,155.20544000000001,0,2238.8384720000004,559.70961800000009,2798.5480900000002,17.88209642172524]
[15,6,"15/6",1922.47,76.898800000000008,1999.3688,147.9532912,159.94950399999999,0,2307.2715952000003,576.81789880000008,2884.0894940000003,18.428686862619809]
[15,7,"15/7",1982.03,79.281199999999998,2061.3112000000001,152.5370288,164.90489600000001,0,2378.7531248,594.68828120000001,2973.4414059999999,18.999625597444091]
[15,8,"15/8",2049.21,81.968400000000003,2131.1784000000002,157.70720160000002,170.49427200000002,0,2459.3798736000003,614.84496840000008,3074.2248420000005,19.643609214057513]
[20,0,"20/0",1724.78,68.991200000000006,1793.7711999999999,132.73906879999998,143.50169600000001,0,2070.0119648,517.5029912,2587.514956,16.533641891373801]
[20,1,"20/1",1767.87,70.714799999999997,1838.5847999999999,136.05527519999998,147.08678399999999,0,2121.7268592,530.43171480000001,2652.158574,16.946700153354634]
[20,2,"20/2",1814.76,72.590400000000002,1887.3504,139.66392959999999,150.988032,0,2178.0023616000003,544.50059040000008,2722.5029520000003,17.396184996805115]
[20,3,"20/3",1865.45,74.618000000000009,1940.068,143.565032,155.20544000000001,0,2238.8384720000004,559.70961800000009,2798.5480900000002,17.88209642172524]
[20,4,"20/4",1922.47,76.898800000000008,1999.3688,147.9532912,159.94950399999999,0,2307.2715952000003,576.81789880000008,2884.0894940000003,18.428686862619809]
[20,5,"20/5",1982.03,79.281199999999998,2061.3112000000001,152.5370288,164.90489600000001,0,2378.7531248,594.68828120000001,2973.4414059999999,18.999625597444091]
[20,6,"20/6",2049.21,81.968400000000003,2131.1784000000002,157.70720160000002,170.49427200000002,0,2459.3798736000003,614.84496840000008,3074.2248420000005,19.643609214057513]
[20,7,"20/7",2116.36,84.65440000000001,2201.0144,162.8750656,176.081152,0,2539.9706176000004,634.99265440000011,3174.9632720000004,20.28730525239617]
[20,8,"20/8",2178.4899999999998,87.139599999999987,2265.6295999999998,167.65659039999997,181.25036799999998,0,2614.5365583999996,653.63413959999991,3268.1706979999994,20.882879859424918]
[25,0,"25/0",1767.87,70.714799999999997,1838.5847999999999,136.05527519999998,147.08678399999999,0,2121.7268592,530.43171480000001,2652.158574,16.946700153354634]
[25,1,"25/1",1814.76,72.590400000000002,1887.3504,139.66392959999999,150.988032,0,2178.0023616000003,544.50059040000008,2722.5029520000003,17.396184996805115]
[25,2,"25/2",1865.45,74.618000000000009,1940.068,143.565032,155.20544000000001,0,2238.8384720000004,559.70961800000009,2798.5480900000002,17.88209642172524]
[25,3,"25/3",1922.47,76.898800000000008,1999.3688,147.9532912,159.94950399999999,0,2307.2715952000003,576.81789880000008,2884.0894940000003,18.428686862619809]
[25,4,"25/4",1982.03,79.281199999999998,2061.3112000000001,152.5370288,164.90489600000001,0,2378.7531248,594.68828120000001,2973.4414059999999,18.999625597444091]
[25,5,"25/5",2049.21,81.968400000000003,2131.1784000000002,157.70720160000002,170.49427200000002,0,2459.3798736000003,614.84496840000008,3074.2248420000005,19.643609214057513]
[25,6,"25/6",2116.36,84.65440000000001,2201.0144,162.8750656,176.081152,0,2539.9706176000004,634.99265440000011,3174.9632720000004,20.28730525239617]
[25,7,"25/7",2178.4899999999998,87.139599999999987,2265.6295999999998,167.65659039999997,181.25036799999998,0,2614.5365583999996,653.63413959999991,3268.1706979999994,20.882879859424918]
[25,8,"25/8",2248.15,89.926000000000002,2338.076,173.01762399999998,187.04608000000002,0,2698.1397040000002,674.53492600000004,3372.6746300000004,21.550636613418533]
[25,9,"25/9",2305.1799999999998,92.2072,2397.3871999999997,177.40665279999996,191.79097599999997,0,2766.5848287999993,691.64620719999982,3458.2310359999992,22.097322913738015]
[30,0,"30/0",1767.87,70.714799999999997,1838.5847999999999,136.05527519999998,147.08678399999999,0,2121.7268592,530.43171480000001,2652.158574,16.946700153354634]
[30,1,"30/1",1814.76,72.590400000000002,1887.3504,139.66392959999999,150.988032,0,2178.0023616000003,544.50059040000008,2722.5029520000003,17.396184996805115]
[30,2,"30/2",1865.45,74.618000000000009,1940.068,143.565032,155.20544000000001,0,2238.8384720000004,559.70961800000009,2798.5480900000002,17.88209642172524]
[30,3,"30/3",1922.47,76.898800000000008,1999.3688,147.9532912,159.94950399999999,0,2307.2715952000003,576.81789880000008,2884.0894940000003,18.428686862619809]
[30,4,"30/4",1982.03,79.281199999999998,2061.3112000000001,152.5370288,164.90489600000001,0,2378.7531248,594.68828120000001,2973.4414059999999,18.999625597444091]
[30,5,"30/5",2049.21,81.968400000000003,2131.1784000000002,157.70720160000002,170.49427200000002,0,2459.3798736000003,614.84496840000008,3074.2248420000005,19.643609214057513]
[30,6,"30/6",2116.36,84.65440000000001,2201.0144,162.8750656,176.081152,0,2539.9706176000004,634.99265440000011,3174.9632720000004,20.28730525239617]
[30,7,"30/7",2178.4899999999998,87.139599999999987,2265.6295999999998,167.65659039999997,181.25036799999998,0,2614.5365583999996,653.63413959999991,3268.1706979999994,20.882879859424918]
[30,8,"30/8",2248.15,89.926000000000002,2338.076,173.01762399999998,187.04608000000002,0,2698.1397040000002,674.53492600000004,3372.6746300000004,21.550636613418533]
[30,9,"30/9",2305.1799999999998,92.2072,2397.3871999999997,177.40665279999996,191.79097599999997,0,2766.5848287999993,691.64620719999982,3458.2310359999992,22.097322913738015]
[30,10,"30/10",2373.63,94.9452,2468.5752000000002,182.67456480000001,197.48601600000003,0,2848.7357808000002,712.18394520000004,3560.9197260000001,22.753480677316293]
[35,0,"35/0",1865.45,74.618000000000009,1940.068,143.565032,155.20544000000001,0,2238.8384720000004,559.70961800000009,2798.5480900000002,17.88209642172524]
[35,1,"35/1",1922.47,76.898800000000008,1999.3688,147.9532912,159.94950399999999,0,2307.2715952000003,576.81789880000008,2884.0894940000003,18.428686862619809]
[35,2,"35/2",1982.03,79.281199999999998,2061.3112000000001,152.5370288,164.90489600000001,0,2378.7531248,594.68828120000001,2973.4414059999999,18.999625597444091]
[35,3,"35/3",2049.21,81.968400000000003,2131.1784000000002,157.70720160000002,170.49427200000002,0,2459.3798736000003,614.84496840000008,3074.2248420000005,19.643609214057513]
[35,4,"35/4",2116.36,84.65440000000001,2201.0144,162.8750656,176.081152,0,2539.9706176000004,634.99265440000011,3174.9632720000004,20.28730525239617]
[35,5,"35/5",2178.4899999999998,87.139599999999987,2265.6295999999998,167.65659039999997,181.25036799999998,0,2614.5365583999996,653.63413959999991,3268.1706979999994,20.882879859424918]
[35,6,"35/6",2248.15,89.926000000000002,2338.076,173.01762399999998,187.04608000000002,0,2698.1397040000002,674.53492600000004,3372.6746300000004,21.550636613418533]
[35,7,"35/7",2305.1799999999998,92.2072,2397.3871999999997,177.40665279999996,191.79097599999997,0,2766.5848287999993,691.64620719999982,3458.2310359999992,22.097322913738015]
[35,8,"35/8",2373.63,94.9452,2468.5752000000002,182.67456480000001,197.48601600000003,0,2848.7357808000002,712.18394520000004,3560.9197260000001,22.753480677316293]
[35,9,"35/9",2435.7199999999998,97.428799999999995,2533.1487999999999,187.45301119999999,202.651904,0,2923.2537152,730.8134288,3654.0671440000001,23.348671846645367]
[35,10,"35/10",2501.63,100.0652,2601.6952000000001,192.5254448,208.13561600000003,0,3002.3562608000002,750.58906520000005,3752.945326,23.980481316293929]
[35,11,"35/11",2566.2800000000002,102.65120000000002,2668.9312,197.50090879999999,213.51449600000001,0,3079.9466048000004,769.9866512000001,3849.9332560000003,24.600212498402559]
[40,0,"40/0",1982.03,79.281199999999998,2061.3112000000001,152.5370288,164.90489600000001,0,2378.7531248,594.68828120000001,2973.4414059999999,18.999625597444091]
[40,1,"40/1",2116.36,84.65440000000001,2201.0144,162.8750656,176.081152,0,2539.9706176000004,634.99265440000011,3174.9632720000004,20.28730525239617]
[40,2,"40/2",2248.15,89.926000000000002,2338.076,173.01762399999998,187.04608000000002,0,2698.1397040000002,674.53492600000004,3372.6746300000004,21.550636613418533]
[40,3,"40/3",2305.1799999999998,92.2072,2397.3871999999997,177.40665279999996,191.79097599999997,0,2766.5848287999993,691.64620719999982,3458.2310359999992,22.097322913738015]
[40,4,"40/4",2373.63,94.9452,2468.5752000000002,182.67456480000001,197.48601600000003,0,2848.7357808000002,712.18394520000004,3560.9197260000001,22.753480677316293]
[40,5,"40/5",2435.7199999999998,97.428799999999995,2533.1487999999999,187.45301119999999,202.651904,0,2923.2537152,730.8134288,3654.0671440000001,23.348671846645367]
[40,6,"40/6",2501.63,100.0652,2601.6952000000001,192.5254448,208.13561600000003,0,3002.3562608000002,750.58906520000005,3752.945326,23.980481316293929]
[40,7,"40/7",2566.2800000000002,102.65120000000002,2668.9312,197.50090879999999,213.51449600000001,0,3079.9466048000004,769.9866512000001,3849.9332560000003,24.600212498402559]
[40,8,"40/8",2629.63,105.18520000000001,2734.8152,202.37632479999999,218.78521599999999,0,3155.9767407999998,788.99418519999995,3944.970926,25.207481955271565]
[40,9,"40/9",2694.26,107.77040000000001,2802.0304000000001,207.35024959999998,224.16243200000002,0,3233.5430816000003,808.38577040000007,4041.9288520000005,25.827021418530354]
[40,10,"40/10",2760.17,110.4068,2870.5768000000003,212.42268320000002,229.64614400000002,0,3312.6456272,828.16140680000001,4140.8070340000004,26.458830888178916]
[45,0,"45/0",2501.63,100.0652,2601.6952000000001,192.5254448,208.13561600000003,0,3002.3562608000002,750.58906520000005,3752.945326,23.980481316293929]
[45,1,"45/1",2566.2800000000002,102.65120000000002,2668.9312,197.50090879999999,213.51449600000001,0,3079.9466048000004,769.9866512000001,3849.9332560000003,24.600212498402559]
[45,2,"45/2",2629.63,105.18520000000001,2734.8152,202.37632479999999,218.78521599999999,0,3155.9767407999998,788.99418519999995,3944.970926,25.207481955271565]
[45,3,"45/3",2694.26,107.77040000000001,2802.0304000000001,207.35024959999998,224.16243200000002,0,3233.5430816000003,808.38577040000007,4041.9288520000005,25.827021418530354]
[45,4,"45/4",2760.17,110.4068,2870.5768000000003,212.42268320000002,229.64614400000002,0,3312.6456272,828.16140680000001,4140.8070340000004,26.458830888178916]
[45,5,"45/5",2827.32,113.09280000000001,2940.4128000000001,217.5905472,235.233024,0,3393.2363712000001,848.30909280000003,4241.5454639999998,27.102526926517569]
[45,6,"45/6",2897.01,115.88040000000001,3012.8904000000002,222.9538896,241.03123200000002,0,3476.8755216,869.21888039999999,4346.0944019999997,27.770571258785942]
[45,7,"45/7",2969.29,118.77160000000001,3088.0616,228.51655839999998,247.044928,0,3563.6230863999999,890.90577159999998,4454.5288579999997,28.463443182108623]
[45,8,"45/8",3032.6,121.304,3153.904,233.38889599999999,252.31232,0,3639.6052159999999,909.90130399999998,4549.5065199999999,29.070329201277954]
[50,0,"50/0",2566.2800000000002,102.65120000000002,2668.9312,197.50090879999999,213.51449600000001,0,3079.9466048000004,769.9866512000001,3849.9332560000003,24.600212498402559]
[50,1,"50/1",2694.26,107.77040000000001,2802.0304000000001,207.35024959999998,224.16243200000002,0,3233.5430816000003,808.38577040000007,4041.9288520000005,25.827021418530354]
[50,2,"50/2",2827.32,113.09280000000001,2940.4128000000001,217.5905472,235.233024,0,3393.2363712000001,848.30909280000003,4241.5454639999998,27.102526926517569]
[50,3,"50/3",2969.29,118.77160000000001,3088.0616,228.51655839999998,247.044928,0,3563.6230863999999,890.90577159999998,4454.5288579999997,28.463443182108623]
[50,4,"50/4",3032.6,121.304,3153.904,233.38889599999999,252.31232,0,3639.6052159999999,909.90130399999998,4549.5065199999999,29.070329201277954]
[50,5,"50/5",3103.58,124.14319999999999,3227.7231999999999,238.85151679999998,258.21785599999998,0,3724.7925728,931.1981432,4655.9907160000002,29.750739399361024]
[50,6,"50/6",3173.31,126.9324,3300.2424000000001,244.2179376,264.01939200000004,0,3808.4797296000002,952.11993240000004,4760.5996620000005,30.419167169329079]
[50,7,"50/7",3239.2,129.56799999999998,3368.768,249.28883199999999,269.50144,0,3887.5582720000002,971.88956800000005,4859.4478400000007,31.0507849201278]
[50,8,"50/8",3305.07,132.2028,3437.2728000000002,254.3581872,274.98182400000002,0,3966.6128112000001,991.65320280000003,4958.2660139999998,31.682210952076677]
[50,9,"50/9",3374.78,134.99120000000002,3509.7712000000001,259.72306880000002,280.78169600000001,0,4050.2759648000001,1012.5689912,5062.8449559999999,32.350447003194887]
[50,10,"50/10",3444.48,137.7792,3582.2592,265.0871808,286.580736,0,4133.9271168000005,1033.4817792000001,5167.4088960000008,33.018587194888184]
[55,0,"55/0",2694.26,107.77040000000001,2802.0304000000001,207.35024959999998,224.16243200000002,0,3233.5430816000003,808.38577040000007,4041.9288520000005,25.827021418530354]
[55,1,"55/1",2897.01,115.88040000000001,3012.8904000000002,222.9538896,241.03123200000002,0,3476.8755216,869.21888039999999,4346.0944019999997,27.770571258785942]
[55,2,"55/2",3032.6,121.304,3153.904,233.38889599999999,252.31232,0,3639.6052159999999,909.90130399999998,4549.5065199999999,29.070329201277954]
[55,3,"55/3",3173.31,126.9324,3300.2424000000001,244.2179376,264.01939200000004,0,3808.4797296000002,952.11993240000004,4760.5996620000005,30.419167169329079]
[55,4,"55/4",3305.07,132.2028,3437.2728000000002,254.3581872,274.98182400000002,0,3966.6128112000001,991.65320280000003,4958.2660139999998,31.682210952076677]
[55,5,"55/5",3444.48,137.7792,3582.2592,265.0871808,286.580736,0,4133.9271168000005,1033.4817792000001,5167.4088960000008,33.018587194888184]
[55,6,"55/6",3509.14,140.3656,3649.5056,270.0634144,291.96044799999999,0,4211.5294623999998,1052.8823656,5264.4118280000002,33.638414236421724]
[55,7,"55/7",3573.76,142.9504,3716.7104000000004,275.03656960000001,297.33683200000002,0,4289.0838016000007,1072.2709504000002,5361.3547520000011,34.257857840255596]
[55,8,"55/8",3648.55,145.94200000000001,3794.4920000000002,280.79240800000002,303.55936000000003,0,4378.8437680000006,1094.7109420000002,5473.5547100000003,34.974790479233228]
[55,9,"55/9",3724.58,148.98320000000001,3873.5632000000001,286.64367679999998,309.88505600000002,0,4470.0919328,1117.5229832,5587.6149160000004,35.703609686900961]
[55,10,"55/10",3799.35,151.97399999999999,3951.3240000000001,292.39797599999997,316.10592000000003,0,4559.8278959999998,1139.9569739999999,5699.7848699999995,36.420350607028752]
[55,11,"55/11",3866.52,154.66079999999999,4021.1808000000001,297.5673792,321.69446400000004,0,4640.4426432,1160.1106608,5800.553304,37.064238364217253]
[60,0,"60/0",3305.07,132.2028,3437.2728000000002,254.3581872,274.98182400000002,0,3966.6128112000001,991.65320280000003,4958.2660139999998,31.682210952076677]
[60,1,"60/1",3444.48,137.7792,3582.2592,265.0871808,286.580736,0,4133.9271168000005,1033.4817792000001,5167.4088960000008,33.018587194888184]
[60,2,"60/2",3573.76,142.9504,3716.7104000000004,275.03656960000001,297.33683200000002,0,4289.0838016000007,1072.2709504000002,5361.3547520000011,34.257857840255596]
[60,3,"60/3",3724.58,148.98320000000001,3873.5632000000001,286.64367679999998,309.88505600000002,0,4470.0919328,1117.5229832,5587.6149160000004,35.703609686900961]
[60,4,"60/4",3866.52,154.66079999999999,4021.1808000000001,297.5673792,321.69446400000004,0,4640.4426432,1160.1106608,5800.553304,37.064238364217253]
[60,5,"60/5",4012.27,160.49080000000001,4172.7608,308.78429919999996,333.82086400000003,0,4815.3659631999999,1203.8414908,6019.2074539999994,38.46138948242811]
[60,6,"60/6",4152.8999999999996,166.11599999999999,4319.0159999999996,319.60718399999996,345.52127999999999,0,4984.144464,1246.036116,6230.1805800000002,39.809460575079875]
[60,7,"60/7",4215.0200000000004,168.60080000000002,4383.6208000000006,324.38793920000001,350.68966400000005,0,5058.6984032000009,1264.6746008000002,6323.3730040000009,40.40493932268371]
[60,8,"60/8",4278.38,171.1352,4449.5151999999998,329.26412479999999,355.96121599999998,0,5134.7405407999995,1283.6851351999999,6418.4256759999989,41.012304638977632]
[60,9,"60/9",4344.2700000000004,173.77080000000001,4518.0408000000007,334.33501920000003,361.44326400000006,0,5213.8190832000009,1303.4547708000002,6517.2738540000009,41.643922389776364]
[60,10,"60/10",4407.6499999999996,176.30599999999998,4583.9559999999992,339.21274399999993,366.71647999999993,0,5289.8852239999987,1322.4713059999997,6612.3565299999982,42.251479424920113]
[65,0,"65/0",3724.58,148.98320000000001,3873.5632000000001,286.64367679999998,309.88505600000002,0,4470.0919328,1117.5229832,5587.6149160000004,35.703609686900961]
[65,1,"65/1",3866.52,154.66079999999999,4021.1808000000001,297.5673792,321.69446400000004,0,4640.4426432,1160.1106608,5800.553304,37.064238364217253]
[65,2,"65/2",3941.29,157.6516,4098.9416000000001,303.3216784,327.91532799999999,0,4730.1786063999998,1182.5446516,5912.723258,37.780979284345051]
[65,3,"65/3",4012.27,160.49080000000001,4172.7608,308.78429919999996,333.82086400000003,0,4815.3659631999999,1203.8414908,6019.2074539999994,38.46138948242811]
[65,4,"65/4",4084.5,163.38,4247.88,314.34312,339.8304,0,4902.0535200000004,1225.5133800000001,6127.5669000000007,39.153782108626203]
[65,5,"65/5",4152.8999999999996,166.11599999999999,4319.0159999999996,319.60718399999996,345.52127999999999,0,4984.144464,1246.036116,6230.1805800000002,39.809460575079875]
[65,6,"65/6",4278.38,171.1352,4449.5151999999998,329.26412479999999,355.96121599999998,0,5134.7405407999995,1283.6851351999999,6418.4256759999989,41.012304638977632]
[65,7,"65/7",4407.6499999999996,176.30599999999998,4583.9559999999992,339.21274399999993,366.71647999999993,0,5289.8852239999987,1322.4713059999997,6612.3565299999982,42.251479424920113]
[65,8,"65/8",4538.18,181.52720000000002,4719.7072000000007,349.25833280000006,377.57657600000005,0,5446.5421088000012,1361.6355272000003,6808.1776360000013,43.502732498402565]
[65,9,"65/9",4667.42,186.6968,4854.1167999999998,359.20464319999996,388.32934399999999,0,5601.6507871999993,1400.4126967999998,7002.0634839999993,44.741619706070281]
[65,10,"65/10",4797.96,191.91840000000002,4989.8783999999996,369.25100159999994,399.19027199999999,0,5758.3196735999991,1439.5799183999998,7197.8995919999988,45.992968638977629]
[65,11,"65/11",4928.5,197.14000000000001,5125.6400000000003,379.29736000000003,410.05120000000005,0,5914.9885599999998,1478.7471399999999,7393.7356999999993,47.244317571884977]
[65,12,"65/12",4991.87,199.6748,5191.5447999999997,384.17431519999997,415.32358399999998,0,5991.0426991999993,1497.7606747999998,7488.8033739999992,47.851778747603831]
[65,13,"65/13",5056.4799999999996,202.25919999999999,5258.7392,389.14670079999996,420.69913600000001,0,6068.5850368000001,1517.1462592,7585.7312959999999,48.471126492012779]
[65,14,"65/14",5123.66,204.94640000000001,5328.6063999999997,394.31687359999995,426.28851199999997,0,6149.2117855999995,1537.3029463999999,7686.5147319999996,49.115110108626197]
[65,15,"65/15",5188.29,207.5316,5395.8216000000002,399.29079839999997,431.665728,0,6226.7781264000005,1556.6945316000001,7783.4726580000006,49.734649571884987]
[70,0,"70/0",4407.6499999999996,176.30599999999998,4583.9559999999992,339.21274399999993,366.71647999999993,0,5289.8852239999987,1322.4713059999997,6612.3565299999982,42.251479424920113]
[70,1,"70/1",4538.18,181.52720000000002,4719.7072000000007,349.25833280000006,377.57657600000005,0,5446.5421088000012,1361.6355272000003,6808.1776360000013,43.502732498402565]
[70,2,"70/2",4604.07,184.1628,4788.2327999999998,354.32922719999999,383.05862400000001,0,5525.6206511999999,1381.4051628,6907.0258139999996,44.134350249201276]
[70,3,"70/3",4667.42,186.6968,4854.1167999999998,359.20464319999996,388.32934399999999,0,5601.6507871999993,1400.4126967999998,7002.0634839999993,44.741619706070281]
[70,4,"70/4",4734.6000000000004,189.38400000000001,4923.9840000000004,364.37481600000001,393.91872000000006,0,5682.2775359999996,1420.5693839999999,7102.84692,45.385603322683707]
[70,5,"70/5",4928.5,197.14000000000001,5125.6400000000003,379.29736000000003,410.05120000000005,0,5914.9885599999998,1478.7471399999999,7393.7356999999993,47.244317571884977]
[70,6,"70/6",5123.66,204.94640000000001,5328.6063999999997,394.31687359999995,426.28851199999997,0,6149.2117855999995,1537.3029463999999,7686.5147319999996,49.115110108626197]
[70,7,"70/7",5318.82,212.75279999999998,5531.5727999999999,409.33638719999999,442.525824,0,6383.4350112000002,1595.8587528,7979.293764,50.98590264536741]
[70,8,"70/8",5449.34,217.9736,5667.3136000000004,419.3812064,453.38508800000005,0,6540.0798944000007,1635.0199736000002,8175.0998680000012,52.237059859424924]
[70,9,"70/9",5610.33,224.41319999999999,5834.7431999999999,431.77099679999998,466.77945599999998,0,6733.2936528,1683.3234132,8416.6170660000007,53.780300741214063]
[70,10,"70/10",5773.78,230.9512,6004.7312000000002,444.35010879999999,480.37849600000004,0,6929.4598048000007,1732.3649512000002,8661.8247560000018,55.347123041533557]
[70,11,"70/11",5936,237.44,6173.44,456.83455999999995,493.87520000000001,0,7124.1497600000002,1781.0374400000001,8905.1872000000003,56.902154632587859]
[70,12,"70/12",6015.84,240.6336,6256.4736000000003,462.97904640000002,500.51788800000003,0,7219.9705344000004,1804.9926336000001,9024.9631680000002,57.667496281150164]
[70,13,"70/13",6099.46,243.97839999999999,6343.4384,469.41444159999998,507.47507200000001,0,7320.3279136000001,1830.0819784,9150.4098919999997,58.46907279233227]
[70,14,"70/14",6180.59,247.2236,6427.8136000000004,475.65820639999998,514.22508800000003,0,7417.6968944000009,1854.4242236000002,9272.1211180000009,59.246780306709269]
[70,15,"70/15",6261.7,250.46799999999999,6512.1679999999997,481.90043199999997,520.97343999999998,0,7515.0418719999998,1878.7604679999999,9393.8023400000002,60.02429610223642]
[75,0,"75/0",5056.4799999999996,202.25919999999999,5258.7392,389.14670079999996,420.69913600000001,0,6068.5850368000001,1517.1462592,7585.7312959999999,48.471126492012779]
[75,1,"75/1",5188.29,207.5316,5395.8216000000002,399.29079839999997,431.665728,0,6226.7781264000005,1556.6945316000001,7783.4726580000006,49.734649571884987]
[75,2,"75/2",5318.82,212.75279999999998,5531.5727999999999,409.33638719999999,442.525824,0,6383.4350112000002,1595.8587528,7979.293764,50.98590264536741]
[75,3,"75/3",5382.19,215.2876,5597.4775999999993,414.21334239999993,447.79820799999993,0,6459.4891503999997,1614.8722875999999,8074.3614379999999,51.593363821086264]
[75,4,"75/4",5449.34,217.9736,5667.3136000000004,419.3812064,453.38508800000005,0,6540.0798944000007,1635.0199736000002,8175.0998680000012,52.237059859424924]
[75,5,"75/5",5529.18,221.16720000000001,5750.3472000000002,425.5256928,460.02777600000002,0,6635.9006687999999,1658.9751672,8294.8758359999993,53.002401507987216]
[75,6,"75/6",5773.78,230.9512,6004.7312000000002,444.35010879999999,480.37849600000004,0,6929.4598048000007,1732.3649512000002,8661.8247560000018,55.347123041533557]
[75,7,"75/7",6015.84,240.6336,6256.4736000000003,462.97904640000002,500.51788800000003,0,7219.9705344000004,1804.9926336000001,9024.9631680000002,57.667496281150164]
[75,8,"75/8",6261.7,250.46799999999999,6512.1679999999997,481.90043199999997,520.97343999999998,0,7515.0418719999998,1878.7604679999999,9393.8023400000002,60.02429610223642]
[75,9,"75/9",6425.17,257.0068,6682.1768000000002,494.4810832,534.57414400000005,0,7711.2320272000006,1927.8080068000002,9639.0400340000015,61.591310121405762]
[75,10,"75/10",6595,263.8,6858.8,507.55119999999999,548.70400000000006,0,7915.0551999999998,1978.7637999999999,9893.8189999999995,63.219290734824277]
[75,11,"75/11",6776.2,271.048,7047.2479999999996,521.49635199999989,563.77984000000004,0,8132.5241919999999,2033.131048,10165.65524,64.956263514377]
[75,12,"75/12",6960,278.40000000000003,7238.4,535.64159999999993,579.072,0,8353.1135999999988,2088.2783999999997,10441.391999999998,66.718159744408936]
[75,13,"75/13",7048.67,281.9468,7330.6167999999998,542.46564319999993,586.449344,0,8459.5317871999996,2114.8829467999999,10574.414734,67.568145265175716]
[75,14,"75/14",7141.19,285.64760000000001,7426.8375999999998,549.58598239999992,594.14700800000003,0,8570.5705904000006,2142.6426476000001,10713.213238,68.455036664536749]
[75,15,"75/15",7247.63,289.90520000000004,7537.5352000000003,557.77760479999995,603.00281600000005,0,8698.3156208,2174.5789052,10872.894526,69.475364383386577]
[75,16,"75/16",7355.37,294.21480000000003,7649.5847999999996,566.06927519999999,611.96678399999996,0,8827.6208592000003,2206.9052148000001,11034.526074000001,70.50815382747605]
[75,17,"75/17",7460.53,298.4212,7758.9511999999995,574.16238879999992,620.71609599999999,0,8953.8296847999991,2238.4574211999998,11192.287106,71.516211539936094]
[75,18,"75/18",7568.26,302.73040000000003,7870.9904000000006,582.45328960000006,629.67923200000007,0,9083.1229216000011,2270.7807304000003,11353.903652000001,72.548905124600651]
[80,0,"80/0",5936,237.44,6173.44,456.83455999999995,493.87520000000001,0,7124.1497600000002,1781.0374400000001,8905.1872000000003,56.902154632587859]
[80,1,"80/1",6099.46,243.97839999999999,6343.4384,469.41444159999998,507.47507200000001,0,7320.3279136000001,1830.0819784,9150.4098919999997,58.46907279233227]
[80,2,"80/2",6261.7,250.46799999999999,6512.1679999999997,481.90043199999997,520.97343999999998,0,7515.0418719999998,1878.7604679999999,9393.8023400000002,60.02429610223642]
[80,3,"80/3",6342.79,253.7116,6596.5015999999996,488.14111839999993,527.72012799999993,0,7612.3628463999994,1903.0907115999998,9515.4535579999992,60.80162017891373]
[80,4,"80/4",6425.17,257.0068,6682.1768000000002,494.4810832,534.57414400000005,0,7711.2320272000006,1927.8080068000002,9639.0400340000015,61.591310121405762]
[80,5,"80/5",6505,260.2,6765.2,500.62479999999994,541.21600000000001,0,7807.0407999999998,1951.7601999999999,9758.8009999999995,62.356555910543129]
[80,6,"80/6",6776.2,271.048,7047.2479999999996,521.49635199999989,563.77984000000004,0,8132.5241919999999,2033.131048,10165.65524,64.956263514377]
[80,7,"80/7",7048.67,281.9468,7330.6167999999998,542.46564319999993,586.449344,0,8459.5317871999996,2114.8829467999999,10574.414734,67.568145265175716]
[80,8,"80/8",7355.37,294.21480000000003,7649.5847999999996,566.06927519999999,611.96678399999996,0,8827.6208592000003,2206.9052148000001,11034.526074000001,70.50815382747605]
[80,9,"80/9",7568.26,302.73040000000003,7870.9904000000006,582.45328960000006,629.67923200000007,0,9083.1229216000011,2270.7807304000003,11353.903652000001,72.548905124600651]
[80,10,"80/10",7778.63,311.14519999999999,8089.7752,598.64336479999997,647.18201599999998,0,9335.6005808000009,2333.9001452000002,11669.500726000002,74.56549984664538]
[80,11,"80/11",7991.54,319.66160000000002,8311.2016000000003,615.02891839999995,664.89612800000009,0,9591.1266464,2397.7816616,11988.908308,76.606442862619815]
[80,12,"80/12",8207.01,328.28040000000004,8535.2903999999999,631.61148959999991,682.82323199999996,0,9849.7251216000004,2462.4312804000001,12312.156402000001,78.671925891373803]
[80,13,"80/13",8313.4500000000007,332.53800000000001,8645.9880000000012,639.80311200000006,691.6790400000001,0,9977.4701520000017,2494.3675380000004,12471.837690000002,79.692253610223659]
[80,14,"80/14",8421.17,336.84680000000003,8758.0167999999994,648.09324319999996,700.641344,0,10106.751387199998,2526.6878467999995,12633.439233999998,80.724851335463242]
[80,15,"80/15",8527.61,341.10440000000006,8868.7144000000008,656.28486559999999,709.49715200000003,0,10234.496417600001,2558.6241044000003,12793.120522000001,81.745179054313112]
[80,16,"80/16",8634.06,345.36239999999998,8979.4223999999995,664.47725759999992,718.353792,0,10362.253449599999,2590.5633623999997,12952.816811999999,82.765602632587857]
[80,17,"80/17",8743.02,349.7208,9092.7407999999996,672.86281919999999,727.419264,0,10493.022883199999,2623.2557207999998,13116.278603999999,83.81008692651757]
[80,18,"80/18",8849.49,353.9796,9203.4696000000004,681.05675039999994,736.27756800000009,0,10620.803918399999,2655.2009795999998,13276.004897999999,84.830702223642163]

{"sheet":"Data CAO GGZ 2019 (verbergen)","index":16,"n_rows":183,"n_cols":13,"rows_kept":183,"cut":false,"hidden":true,"merged":[]}
["Cao GGZ schalen per 1-1-2019"]
[null,null,null,null,0,null,8.3299999999999999E-2,0.08,1.7500000000000002E-2,null,{"$f":"17%+8%","v":0.25},null,{"$f":"1878/12","v":156.5}]
["Funct.schaal","Trede","Samengesteld","Salaris","Verhoging","Nieuw salaris","EJU","Vak toeslag","LFB","Brutoloon","Soc.lasten + pens.pr.","Tot incl soc lst + pens.pr.","Uurloon"]
[10,0,{"$f":"CONCATENATE(A4,\"/\",B4)","v":"10/0"},1571,{"$f":"D4*$E$2","v":0},{"$f":"D4+E4","v":1571},{"$f":"F4*$G$2","v":130.86429999999999},{"$f":"F4*$H$2","v":125.68},{"$f":"D4*$I$2","v":27.492500000000003},{"$f":"SUM(F4:I4)","v":1855.0368000000001},{"$f":"J4*$K$2","v":463.75920000000002},{"$f":"SUM(J4:K4)","v":2318.7960000000003},{"$f":"L4/$M$2","v":14.816587859424923}]
[10,1,"10/1",1629,0,1629,135.69569999999999,130.32,28.507500000000004,1923.5231999999999,480.88079999999997,2404.404,15.363603833865815]
[10,2,"10/2",1660,0,1660,138.27799999999999,132.80000000000001,29.050000000000004,1960.1279999999999,490.03199999999998,2450.16,15.655974440894568]
[10,3,"10/3",1704,0,1704,141.94319999999999,136.32,29.820000000000004,2012.0831999999998,503.02079999999995,2515.1039999999998,16.070952076677315]
[10,4,"10/4",1748,0,1748,145.60839999999999,139.84,30.590000000000003,2064.0383999999999,516.00959999999998,2580.0479999999998,16.485929712460063]
[10,5,"10/5",1793,0,1793,149.3569,143.44,31.377500000000001,2117.1743999999999,529.29359999999997,2646.4679999999998,16.910338658146962]
[10,6,"10/6",1843,0,1843,153.52189999999999,147.44,32.252500000000005,2176.2143999999998,544.05359999999996,2720.268,17.381904153354633]
[10,7,"10/7",1899,0,1899,158.1867,151.92000000000002,33.232500000000002,2242.3392000000003,560.58480000000009,2802.9240000000004,17.910057507987222]
[10,8,"10/8",1958,0,1958,163.10139999999998,156.64000000000001,34.265000000000001,2312.0063999999998,578.00159999999994,2890.0079999999998,18.466504792332266]
[15,0,"15/0",1629,0,1629,135.69569999999999,130.32,28.507500000000004,1923.5231999999999,480.88079999999997,2404.404,15.363603833865815]
[15,1,"15/1",1660,0,1660,138.27799999999999,132.80000000000001,29.050000000000004,1960.1279999999999,490.03199999999998,2450.16,15.655974440894568]
[15,2,"15/2",1704,0,1704,141.94319999999999,136.32,29.820000000000004,2012.0831999999998,503.02079999999995,2515.1039999999998,16.070952076677315]
[15,3,"15/3",1748,0,1748,145.60839999999999,139.84,30.590000000000003,2064.0383999999999,516.00959999999998,2580.0479999999998,16.485929712460063]
[15,4,"15/4",1793,0,1793,149.3569,143.44,31.377500000000001,2117.1743999999999,529.29359999999997,2646.4679999999998,16.910338658146962]
[15,5,"15/5",1843,0,1843,153.52189999999999,147.44,32.252500000000005,2176.2143999999998,544.05359999999996,2720.268,17.381904153354633]
[15,6,"15/6",1899,0,1899,158.1867,151.92000000000002,33.232500000000002,2242.3392000000003,560.58480000000009,2802.9240000000004,17.910057507987222]
[15,7,"15/7",1958,0,1958,163.10139999999998,156.64000000000001,34.265000000000001,2312.0063999999998,578.00159999999994,2890.0079999999998,18.466504792332266]
[15,8,"15/8",2024,0,2024,168.5992,161.92000000000002,35.42,2389.9392000000003,597.48480000000006,2987.4240000000004,19.088971246006391]
[15,9,"15/9",2091,0,2091,174.18029999999999,167.28,36.592500000000001,2469.0528000000004,617.2632000000001,3086.3160000000007,19.720869009584668]
[20,0,"20/0",1660,0,1660,138.27799999999999,132.80000000000001,29.050000000000004,1960.1279999999999,490.03199999999998,2450.16,15.655974440894568]
[20,1,"20/1",1704,0,1704,141.94319999999999,136.32,29.820000000000004,2012.0831999999998,503.02079999999995,2515.1039999999998,16.070952076677315]
[20,2,"20/2",1748,0,1748,145.60839999999999,139.84,30.590000000000003,2064.0383999999999,516.00959999999998,2580.0479999999998,16.485929712460063]
[20,3,"20/3",1793,0,1793,149.3569,143.44,31.377500000000001,2117.1743999999999,529.29359999999997,2646.4679999999998,16.910338658146962]
[20,4,"20/4",1843,0,1843,153.52189999999999,147.44,32.252500000000005,2176.2143999999998,544.05359999999996,2720.268,17.381904153354633]
[20,5,"20/5",1899,0,1899,158.1867,151.92000000000002,33.232500000000002,2242.3392000000003,560.58480000000009,2802.9240000000004,17.910057507987222]
[20,6,"20/6",1958,0,1958,163.10139999999998,156.64000000000001,34.265000000000001,2312.0063999999998,578.00159999999994,2890.0079999999998,18.466504792332266]
[20,7,"20/7",2024,0,2024,168.5992,161.92000000000002,35.42,2389.9392000000003,597.48480000000006,2987.4240000000004,19.088971246006391]
[20,8,"20/8",2091,0,2091,174.18029999999999,167.28,36.592500000000001,2469.0528000000004,617.2632000000001,3086.3160000000007,19.720869009584668]
[20,9,"20/9",2152,0,2152,179.26159999999999,172.16,37.660000000000004,2541.0815999999995,635.27039999999988,3176.3519999999994,20.296178913738014]
[20,10,"20/10",2222,0,2222,185.0926,177.76,38.885000000000005,2623.7376000000004,655.9344000000001,3279.6720000000005,20.956370607028756]
[25,0,"25/0",1704,0,1704,141.94319999999999,136.32,29.820000000000004,2012.0831999999998,503.02079999999995,2515.1039999999998,16.070952076677315]
[25,1,"25/1",1793,0,1793,149.3569,143.44,31.377500000000001,2117.1743999999999,529.29359999999997,2646.4679999999998,16.910338658146962]
[25,2,"25/2",1843,0,1843,153.52189999999999,147.44,32.252500000000005,2176.2143999999998,544.05359999999996,2720.268,17.381904153354633]
[25,3,"25/3",1899,0,1899,158.1867,151.92000000000002,33.232500000000002,2242.3392000000003,560.58480000000009,2802.9240000000004,17.910057507987222]
[25,4,"25/4",1958,0,1958,163.10139999999998,156.64000000000001,34.265000000000001,2312.0063999999998,578.00159999999994,2890.0079999999998,18.466504792332266]
[25,5,"25/5",2024,0,2024,168.5992,161.92000000000002,35.42,2389.9392000000003,597.48480000000006,2987.4240000000004,19.088971246006391]
[25,6,"25/6",2091,0,2091,174.18029999999999,167.28,36.592500000000001,2469.0528000000004,617.2632000000001,3086.3160000000007,19.720869009584668]
[25,7,"25/7",2152,0,2152,179.26159999999999,172.16,37.660000000000004,2541.0815999999995,635.27039999999988,3176.3519999999994,20.296178913738014]
[25,8,"25/8",2222,0,2222,185.0926,177.76,38.885000000000005,2623.7376000000004,655.9344000000001,3279.6720000000005,20.956370607028756]
[25,9,"25/9",2278,0,2278,189.75739999999999,182.24,39.865000000000002,2689.8624,672.46559999999999,3362.328,21.484523961661342]
[25,10,"25/10",2345,0,2345,195.33850000000001,187.6,41.037500000000001,2768.9759999999997,692.24399999999991,3461.2199999999993,22.116421725239611]
[30,0,"30/0",1748,0,1748,145.60839999999999,139.84,30.590000000000003,2064.0383999999999,516.00959999999998,2580.0479999999998,16.485929712460063]
[30,1,"30/1",1843,0,1843,153.52189999999999,147.44,32.252500000000005,2176.2143999999998,544.05359999999996,2720.268,17.381904153354633]
[30,2,"30/2",1958,0,1958,163.10139999999998,156.64000000000001,34.265000000000001,2312.0063999999998,578.00159999999994,2890.0079999999998,18.466504792332266]
[30,3,"30/3",2024,0,2024,168.5992,161.92000000000002,35.42,2389.9392000000003,597.48480000000006,2987.4240000000004,19.088971246006391]
[30,4,"30/4",2091,0,2091,174.18029999999999,167.28,36.592500000000001,2469.0528000000004,617.2632000000001,3086.3160000000007,19.720869009584668]
[30,5,"30/5",2152,0,2152,179.26159999999999,172.16,37.660000000000004,2541.0815999999995,635.27039999999988,3176.3519999999994,20.296178913738014]
[30,6,"30/6",2222,0,2222,185.0926,177.76,38.885000000000005,2623.7376000000004,655.9344000000001,3279.6720000000005,20.956370607028756]
[30,7,"30/7",2278,0,2278,189.75739999999999,182.24,39.865000000000002,2689.8624,672.46559999999999,3362.328,21.484523961661342]
[30,8,"30/8",2345,0,2345,195.33850000000001,187.6,41.037500000000001,2768.9759999999997,692.24399999999991,3461.2199999999993,22.116421725239611]
[30,9,"30/9",2407,0,2407,200.50309999999999,192.56,42.122500000000002,2842.1855999999998,710.54639999999995,3552.732,22.701162939297124]
[30,10,"30/10",2471,0,2471,205.83429999999998,197.68,43.242500000000007,2917.7567999999997,729.43919999999991,3647.1959999999995,23.304766773162935]
[35,0,"35/0",1843,0,1843,153.52189999999999,147.44,32.252500000000005,2176.2143999999998,544.05359999999996,2720.268,17.381904153354633]
[35,1,"35/1",1958,0,1958,163.10139999999998,156.64000000000001,34.265000000000001,2312.0063999999998,578.00159999999994,2890.0079999999998,18.466504792332266]
[35,2,"35/2",2091,0,2091,174.18029999999999,167.28,36.592500000000001,2469.0528000000004,617.2632000000001,3086.3160000000007,19.720869009584668]
[35,3,"35/3",2152,0,2152,179.26159999999999,172.16,37.660000000000004,2541.0815999999995,635.27039999999988,3176.3519999999994,20.296178913738014]
[35,4,"35/4",2222,0,2222,185.0926,177.76,38.885000000000005,2623.7376000000004,655.9344000000001,3279.6720000000005,20.956370607028756]
[35,5,"35/5",2278,0,2278,189.75739999999999,182.24,39.865000000000002,2689.8624,672.46559999999999,3362.328,21.484523961661342]
[35,6,"35/6",2345,0,2345,195.33850000000001,187.6,41.037500000000001,2768.9759999999997,692.24399999999991,3461.2199999999993,22.116421725239611]
[35,7,"35/7",2407,0,2407,200.50309999999999,192.56,42.122500000000002,2842.1855999999998,710.54639999999995,3552.732,22.701162939297124]
[35,8,"35/8",2471,0,2471,205.83429999999998,197.68,43.242500000000007,2917.7567999999997,729.43919999999991,3647.1959999999995,23.304766773162935]
[35,9,"35/9",2535,0,2535,211.16550000000001,202.8,44.362500000000004,2993.3280000000004,748.33200000000011,3741.6600000000008,23.908370607028758]
[35,10,"35/10",2599,0,2599,216.4967,207.92000000000002,45.482500000000002,3068.8992000000003,767.22480000000007,3836.1240000000003,24.511974440894569]
[40,0,"40/0",1958,0,1958,163.10139999999998,156.64000000000001,34.265000000000001,2312.0063999999998,578.00159999999994,2890.0079999999998,18.466504792332266]
[40,1,"40/1",2091,0,2091,174.18029999999999,167.28,36.592500000000001,2469.0528000000004,617.2632000000001,3086.3160000000007,19.720869009584668]
[40,2,"40/2",2222,0,2222,185.0926,177.76,38.885000000000005,2623.7376000000004,655.9344000000001,3279.6720000000005,20.956370607028756]
[40,3,"40/3",2278,0,2278,189.75739999999999,182.24,39.865000000000002,2689.8624,672.46559999999999,3362.328,21.484523961661342]
[40,4,"40/4",2345,0,2345,195.33850000000001,187.6,41.037500000000001,2768.9759999999997,692.24399999999991,3461.2199999999993,22.116421725239611]
[40,5,"40/5",2407,0,2407,200.50309999999999,192.56,42.122500000000002,2842.1855999999998,710.54639999999995,3552.732,22.701162939297124]
[40,6,"40/6",2471,0,2471,205.83429999999998,197.68,43.242500000000007,2917.7567999999997,729.43919999999991,3647.1959999999995,23.304766773162935]
[40,7,"40/7",2535,0,2535,211.16550000000001,202.8,44.362500000000004,2993.3280000000004,748.33200000000011,3741.6600000000008,23.908370607028758]
[40,8,"40/8",2599,0,2599,216.4967,207.92000000000002,45.482500000000002,3068.8992000000003,767.22480000000007,3836.1240000000003,24.511974440894569]
[40,9,"40/9",2663,0,2663,221.8279,213.04,46.602500000000006,3144.4704000000002,786.11760000000004,3930.5880000000002,25.115578274760384]
[40,10,"40/10",2727,0,2727,227.1591,218.16,47.722500000000004,3220.0415999999996,805.01039999999989,4025.0519999999997,25.719182108626196]
[40,11,"40/11",2793,0,2793,232.65690000000001,223.44,48.877500000000005,3297.9744000000001,824.49360000000001,4122.4679999999998,26.341648562300318]
[40,12,"40/12",2863,0,2863,238.4879,229.04,50.102500000000006,3380.6304,845.1576,4225.7880000000005,27.001840255591059]
[45,0,"45/0",2222,0,2222,185.0926,177.76,38.885000000000005,2623.7376000000004,655.9344000000001,3279.6720000000005,20.956370607028756]
[45,1,"45/1",2345,0,2345,195.33850000000001,187.6,41.037500000000001,2768.9759999999997,692.24399999999991,3461.2199999999993,22.116421725239611]
[45,2,"45/2",2471,0,2471,205.83429999999998,197.68,43.242500000000007,2917.7567999999997,729.43919999999991,3647.1959999999995,23.304766773162935]
[45,3,"45/3",2535,0,2535,211.16550000000001,202.8,44.362500000000004,2993.3280000000004,748.33200000000011,3741.6600000000008,23.908370607028758]
[45,4,"45/4",2599,0,2599,216.4967,207.92000000000002,45.482500000000002,3068.8992000000003,767.22480000000007,3836.1240000000003,24.511974440894569]
[45,5,"45/5",2663,0,2663,221.8279,213.04,46.602500000000006,3144.4704000000002,786.11760000000004,3930.5880000000002,25.115578274760384]
[45,6,"45/6",2727,0,2727,227.1591,218.16,47.722500000000004,3220.0415999999996,805.01039999999989,4025.0519999999997,25.719182108626196]
[45,7,"45/7",2793,0,2793,232.65690000000001,223.44,48.877500000000005,3297.9744000000001,824.49360000000001,4122.4679999999998,26.341648562300318]
[45,8,"45/8",2863,0,2863,238.4879,229.04,50.102500000000006,3380.6304,845.1576,4225.7880000000005,27.001840255591059]
[45,9,"45/9",2934,0,2934,244.40219999999999,234.72,51.345000000000006,3464.4671999999996,866.1167999999999,4330.5839999999998,27.671463258785941]
[45,10,"45/10",2996,0,2996,249.5668,239.68,52.430000000000007,3537.6767999999997,884.41919999999993,4422.0959999999995,28.256204472843446]
[45,11,"45/11",3066,0,3066,255.39779999999999,245.28,53.655000000000008,3620.3328000000006,905.08320000000015,4525.4160000000011,28.916396166134192]
[45,12,"45/12",3135,0,3135,261.14549999999997,250.8,54.862500000000004,3701.8080000000004,925.45200000000011,4627.26,29.567156549520767]
[50,0,"50/0",2535,0,2535,211.16550000000001,202.8,44.362500000000004,2993.3280000000004,748.33200000000011,3741.6600000000008,23.908370607028758]
[50,1,"50/1",2663,0,2663,221.8279,213.04,46.602500000000006,3144.4704000000002,786.11760000000004,3930.5880000000002,25.115578274760384]
[50,2,"50/2",2793,0,2793,232.65690000000001,223.44,48.877500000000005,3297.9744000000001,824.49360000000001,4122.4679999999998,26.341648562300318]
[50,3,"50/3",2934,0,2934,244.40219999999999,234.72,51.345000000000006,3464.4671999999996,866.1167999999999,4330.5839999999998,27.671463258785941]
[50,4,"50/4",2996,0,2996,249.5668,239.68,52.430000000000007,3537.6767999999997,884.41919999999993,4422.0959999999995,28.256204472843446]
[50,5,"50/5",3066,0,3066,255.39779999999999,245.28,53.655000000000008,3620.3328000000006,905.08320000000015,4525.4160000000011,28.916396166134192]
[50,6,"50/6",3135,0,3135,261.14549999999997,250.8,54.862500000000004,3701.8080000000004,925.45200000000011,4627.26,29.567156549520767]
[50,7,"50/7",3200,0,3200,266.56,256,56.000000000000007,3778.56,944.64,4723.2,30.180191693290734]
[50,8,"50/8",3266,0,3266,272.05779999999999,261.28000000000003,57.155000000000008,3856.4928000000004,964.12320000000011,4820.6160000000009,30.802658146964863]
[50,9,"50/9",3334,0,3334,277.72219999999999,266.72000000000003,58.345000000000006,3936.7872000000002,984.19680000000005,4920.9840000000004,31.443987220447287]
[50,10,"50/10",3403,0,3403,283.4699,272.24,59.552500000000009,4018.2623999999996,1004.5655999999999,5022.8279999999995,32.094747603833859]
[50,11,"50/11",3467,0,3467,288.80110000000002,277.36,60.672500000000007,4093.8336000000004,1023.4584000000001,5117.2920000000004,32.698351437699685]
[55,0,"55/0",2863,0,2863,238.4879,229.04,50.102500000000006,3380.6304,845.1576,4225.7880000000005,27.001840255591059]
[55,1,"55/1",2996,0,2996,249.5668,239.68,52.430000000000007,3537.6767999999997,884.41919999999993,4422.0959999999995,28.256204472843446]
[55,2,"55/2",3135,0,3135,261.14549999999997,250.8,54.862500000000004,3701.8080000000004,925.45200000000011,4627.26,29.567156549520767]
[55,3,"55/3",3266,0,3266,272.05779999999999,261.28000000000003,57.155000000000008,3856.4928000000004,964.12320000000011,4820.6160000000009,30.802658146964863]
[55,4,"55/4",3403,0,3403,283.4699,272.24,59.552500000000009,4018.2623999999996,1004.5655999999999,5022.8279999999995,32.094747603833859]
[55,5,"55/5",3467,0,3467,288.80110000000002,277.36,60.672500000000007,4093.8336000000004,1023.4584000000001,5117.2920000000004,32.698351437699685]
[55,6,"55/6",3532,0,3532,294.21559999999999,282.56,61.810000000000009,4170.5856000000003,1042.6464000000001,5213.232,33.311386581469648]
[55,7,"55/7",3605,0,3605,300.29649999999998,288.40000000000003,63.087500000000006,4256.7839999999997,1064.1959999999999,5320.98,33.999872204472844]
[55,8,"55/8",3680,0,3680,306.54399999999998,294.40000000000003,64.400000000000006,4345.3439999999991,1086.3359999999998,5431.6799999999985,34.707220447284335]
[55,9,"55/9",3754,0,3754,312.70819999999998,300.32,65.695000000000007,4432.7231999999995,1108.1807999999999,5540.9039999999995,35.40513738019169]
[55,10,"55/10",3820,0,3820,318.20600000000002,305.60000000000002,66.850000000000009,4510.6560000000009,1127.6640000000002,5638.3200000000015,36.027603833865825]
[55,11,"55/11",3894,0,3894,324.37020000000001,311.52,68.14500000000001,4598.0352000000003,1149.5088000000001,5747.5439999999999,36.725520766773165]
[60,0,"60/0",3266,0,3266,272.05779999999999,261.28000000000003,57.155000000000008,3856.4928000000004,964.12320000000011,4820.6160000000009,30.802658146964863]
[60,1,"60/1",3403,0,3403,283.4699,272.24,59.552500000000009,4018.2623999999996,1004.5655999999999,5022.8279999999995,32.094747603833859]
[60,2,"60/2",3532,0,3532,294.21559999999999,282.56,61.810000000000009,4170.5856000000003,1042.6464000000001,5213.232,33.311386581469648]
[60,3,"60/3",3680,0,3680,306.54399999999998,294.40000000000003,64.400000000000006,4345.3439999999991,1086.3359999999998,5431.6799999999985,34.707220447284335]
[60,4,"60/4",3820,0,3820,318.20600000000002,305.60000000000002,66.850000000000009,4510.6560000000009,1127.6640000000002,5638.3200000000015,36.027603833865825]
[60,5,"60/5",3965,0,3965,330.28449999999998,317.2,69.387500000000003,4681.8719999999994,1170.4679999999998,5852.3399999999992,37.395143769968044]
[60,6,"60/6",4104,0,4104,341.86320000000001,328.32,71.820000000000007,4846.0031999999992,1211.5007999999998,6057.503999999999,38.706095846645361]
[60,7,"60/7",4165,0,4165,346.94450000000001,333.2,72.887500000000003,4918.0319999999992,1229.5079999999998,6147.5399999999991,39.281405750798719]
[60,8,"60/8",4228,0,4228,352.19240000000002,338.24,73.990000000000009,4992.4223999999995,1248.1055999999999,6240.5279999999993,39.875578274760379]
[60,9,"60/9",4293,0,4293,357.6069,343.44,75.127500000000012,5069.174399999999,1267.2935999999997,6336.4679999999989,40.488613418530342]
[60,10,"60/10",4355,0,4355,362.7715,348.40000000000003,76.212500000000006,5142.3839999999991,1285.5959999999998,6427.9799999999987,41.073354632587851]
[65,0,"65/0",3820,0,3820,318.20600000000002,305.60000000000002,66.850000000000009,4510.6560000000009,1127.6640000000002,5638.3200000000015,36.027603833865825]
[65,1,"65/1",3965,0,3965,330.28449999999998,317.2,69.387500000000003,4681.8719999999994,1170.4679999999998,5852.3399999999992,37.395143769968044]
[65,2,"65/2",4104,0,4104,341.86320000000001,328.32,71.820000000000007,4846.0031999999992,1211.5007999999998,6057.503999999999,38.706095846645361]
[65,3,"65/3",4228,0,4228,352.19240000000002,338.24,73.990000000000009,4992.4223999999995,1248.1055999999999,6240.5279999999993,39.875578274760379]
[65,4,"65/4",4355,0,4355,362.7715,348.40000000000003,76.212500000000006,5142.3839999999991,1285.5959999999998,6427.9799999999987,41.073354632587851]
[65,5,"65/5",4485,0,4485,373.60050000000001,358.8,78.487500000000011,5295.8880000000008,1323.9720000000002,6619.8600000000006,42.299424920127798]
[65,6,"65/6",4613,0,4613,384.2629,369.04,80.727500000000006,5447.0303999999996,1361.7575999999999,6808.7879999999996,43.506632587859421]
[65,7,"65/7",4741,0,4741,394.92529999999999,379.28000000000003,82.967500000000001,5598.1727999999994,1399.5431999999998,6997.7159999999994,44.713840255591052]
[65,8,"65/8",4871,0,4871,405.7543,389.68,85.242500000000007,5751.6768000000002,1437.9192,7189.5960000000005,45.939910543130992]
[65,9,"65/9",4933,0,4933,410.91890000000001,394.64,86.327500000000015,5824.8864000000003,1456.2216000000001,7281.1080000000002,46.524651757188501]
[65,10,"65/10",4997,0,4997,416.25009999999997,399.76,87.447500000000005,5900.4576000000006,1475.1144000000002,7375.572000000001,47.128255591054319]
[65,11,"65/11",5063,0,5063,421.74790000000002,405.04,88.602500000000006,5978.3904000000002,1494.5976000000001,7472.9880000000003,47.750722044728434]
[65,12,"65/12",5126,0,5126,426.99579999999997,410.08,89.705000000000013,6052.7807999999995,1513.1951999999999,7565.9759999999997,48.344894568690094]
[70,0,"70/0",4485,0,4485,373.60050000000001,358.8,78.487500000000011,5295.8880000000008,1323.9720000000002,6619.8600000000006,42.299424920127798]
[70,1,"70/1",4679,0,4679,389.76069999999999,374.32,81.882500000000007,5524.9631999999992,1381.2407999999998,6906.2039999999988,44.129099041533536]
[70,2,"70/2",4871,0,4871,405.7543,389.68,85.242500000000007,5751.6768000000002,1437.9192,7189.5960000000005,45.939910543130992]
[70,3,"70/3",5063,0,5063,421.74790000000002,405.04,88.602500000000006,5978.3904000000002,1494.5976000000001,7472.9880000000003,47.750722044728434]
[70,4,"70/4",5255,0,5255,437.74149999999997,420.40000000000003,91.962500000000006,6205.1039999999994,1551.2759999999998,7756.3799999999992,49.561533546325876]
[70,5,"70/5",5384,0,5384,448.48719999999997,430.72,94.220000000000013,6357.4272000000001,1589.3568,7946.7839999999997,50.778172523961658]
[70,6,"70/6",5544,0,5544,461.8152,443.52,97.02000000000001,6546.3552,1636.5888,8182.9439999999995,52.287182108626197]
[70,7,"70/7",5705,0,5705,475.22649999999999,456.40000000000003,99.837500000000006,6736.463999999999,1684.1159999999998,8420.5799999999981,53.805623003194874]
[70,8,"70/8",5865,0,5865,488.55450000000002,469.2,102.6375,6925.3919999999998,1731.348,8656.74,55.314632587859421]
[70,9,"70/9",5945,0,5945,495.21850000000001,475.6,104.03750000000001,7019.8560000000007,1754.9640000000002,8774.8200000000015,56.069137380191705]
[70,10,"70/10",6027,0,6027,502.04910000000001,482.16,105.47250000000001,7116.6815999999999,1779.1704,8895.851999999999,56.842504792332264]
[70,11,"70/11",6107,0,6107,508.7131,488.56,106.87250000000002,7211.1456000000007,1802.7864000000002,9013.9320000000007,57.597009584664541]
[70,12,"70/12",6188,0,6188,515.46040000000005,495.04,108.29,7306.7903999999999,1826.6976,9133.4879999999994,58.360945686900955]
[75,0,"75/0",5255,0,5255,437.74149999999997,420.40000000000003,91.962500000000006,6205.1039999999994,1551.2759999999998,7756.3799999999992,49.561533546325876]
[75,1,"75/1",5463,0,5463,455.06790000000001,437.04,95.602500000000006,6450.7103999999999,1612.6776,8063.3879999999999,51.523246006389776]
[75,2,"75/2",5705,0,5705,475.22649999999999,456.40000000000003,99.837500000000006,6736.463999999999,1684.1159999999998,8420.5799999999981,53.805623003194874]
[75,3,"75/3",5945,0,5945,495.21850000000001,475.6,104.03750000000001,7019.8560000000007,1754.9640000000002,8774.8200000000015,56.069137380191705]
[75,4,"75/4",6188,0,6188,515.46040000000005,495.04,108.29,7306.7903999999999,1826.6976,9133.4879999999994,58.360945686900955]
[75,5,"75/5",6349,0,6349,528.87170000000003,507.92,111.10750000000002,7496.8991999999998,1874.2248,9371.1239999999998,59.879386581469646]
[75,6,"75/6",6518,0,6518,542.94939999999997,521.44000000000005,114.06500000000001,7696.4543999999996,1924.1135999999999,9620.5679999999993,61.473277955271563]
[75,7,"75/7",6697,0,6697,557.86009999999999,535.76,117.19750000000001,7907.8176000000003,1976.9544000000001,9884.7720000000008,63.161482428115022]
[75,8,"75/8",6878,0,6878,572.93740000000003,550.24,120.36500000000001,8121.5423999999994,2030.3855999999998,10151.928,64.868549520766777]
[75,9,"75/9",6966,0,6966,580.26779999999997,557.28,121.90500000000002,8225.4527999999991,2056.3631999999998,10281.815999999999,65.698504792332258]
[75,10,"75/10",7057,0,7057,587.84810000000004,564.56000000000006,123.49750000000002,8332.9056,2083.2264,10416.132,66.556753993610215]
[75,11,"75/11",7162,0,7162,596.59460000000001,572.96,125.33500000000001,8456.8895999999986,2114.2223999999997,10571.111999999997,67.547041533546306]
[75,12,"75/12",7269,0,7269,605.5077,581.52,127.20750000000001,8583.235200000001,2145.8088000000002,10729.044000000002,68.556191693290742]
[75,13,"75/13",7372,0,7372,614.08759999999995,589.76,129.01000000000002,8704.8575999999994,2176.2143999999998,10881.072,69.52761661341853]
[75,14,"75/14",7479,0,7479,623.00069999999994,598.32000000000005,130.88250000000002,8831.2031999999999,2207.8008,11039.004000000001,70.536766773162938]
[80,0,"80/0",6188,0,6188,515.46040000000005,495.04,108.29,7306.7903999999999,1826.6976,9133.4879999999994,58.360945686900955]
[80,1,"80/1",6429,0,6429,535.53570000000002,514.32000000000005,112.50750000000001,7591.3631999999998,1897.8407999999999,9489.2039999999997,60.633891373801916]
[80,2,"80/2",6697,0,6697,557.86009999999999,535.76,117.19750000000001,7907.8176000000003,1976.9544000000001,9884.7720000000008,63.161482428115022]
[80,3,"80/3",6966,0,6966,580.26779999999997,557.28,121.90500000000002,8225.4527999999991,2056.3631999999998,10281.815999999999,65.698504792332258]
[80,4,"80/4",7269,0,7269,605.5077,581.52,127.20750000000001,8583.235200000001,2145.8088000000002,10729.044000000002,68.556191693290742]
[80,5,"80/5",7479,0,7479,623.00069999999994,598.32000000000005,130.88250000000002,8831.2031999999999,2207.8008,11039.004000000001,70.536766773162938]
[80,6,"80/6",7688,0,7688,640.41039999999998,615.04,134.54000000000002,9077.9904000000024,2269.4976000000006,11347.488000000003,72.507910543131004]
[80,7,"80/7",7898,0,7898,657.90340000000003,631.84,138.215,9325.9583999999995,2331.4895999999999,11657.448,74.4884856230032]
[80,8,"80/8",8110,0,8110,675.56299999999999,648.80000000000007,141.92500000000001,9576.2879999999986,2394.0719999999997,11970.359999999999,76.487923322683699]
[80,9,"80/9",8216,0,8216,684.39279999999997,657.28,143.78,9701.4528000000009,2425.3632000000002,12126.816000000001,77.487642172523962]
[80,10,"80/10",8322,0,8322,693.22259999999994,665.76,145.63500000000002,9826.6175999999996,2456.6543999999999,12283.271999999999,78.487361022364212]
[80,11,"80/11",8428,0,8428,702.05240000000003,674.24,147.49,9951.7824000000001,2487.9456,12439.727999999999,79.487079872204461]
[80,12,"80/12",8533,0,8533,710.7989,682.64,149.32750000000001,10075.766399999999,2518.9415999999997,12594.707999999999,80.477367412140566]
[80,13,"80/13",8640,0,8640,719.71199999999999,691.2,151.20000000000002,10202.112000000001,2550.5280000000002,12752.640000000001,81.486517571884988]
[80,14,"80/14",8745,0,8745,728.45849999999996,699.6,153.03750000000002,10326.096000000001,2581.5240000000003,12907.620000000003,82.476805111821108]